{"text_format":"1","workbook":"xlsx","n_sheets":44,"sheets":["Config","Ts","Bia","Bia1","TM","Bao cao tham tra","Tong hop kinh phi","THCP tu van","DT man-month","Cp chuyen gia","Tienluong","CPK TV","Tien do TV","THCP khac","CP HMC","CP Du phong","QD957","THDT goi thau XD","THCP xay dung","Don gia tong hop","Du toan XD","Don gia XD","TH vat tu XD","Thong ke thep","Gia vua XD","Gia vat lieu HTXD","Nhan cong XD","Gia ca may XD","Du thau XD","Bia2","THDT goi thau TB","THCP thiet bi","CP mua sam TB","CP dao tao","THCP Lap dat","Du toan LD","Don gia LD","TH vat tu LD","Gia vua LD","Gia vat lieu HTLD","Nhan cong LD","Gia ca may LD","Du thau LD","NhanCong"],"not_rendered":{"charts":0,"images":4,"macros":1,"external_links":4,"defined_names":973,"comments":23,"pivot_tables":0},"unopened":[],"bounds":{"document_bytes":16777216,"sheet_cells":100000,"rows_first":2000,"rows_last":500,"rows_between":2000,"halvings":0,"cell_chars":16384,"cell_head_chars":4096},"cells_cut":0,"cells_raw":0,"read":"whole","date_system":"1900"}

{"sheet":"Config","index":0,"n_rows":100,"n_cols":44,"rows_kept":100,"cut":false,"hidden":true,"merged":[]}
["Name","Tên","GIÁ TRỊ",null,"C:\\Du toan GXD\\Dulieu",1,"HaNoi",null,"Trạng thái",null,"Hạng mục xây dựng",null,"Hạng mục thiết bị",null,null,"Checkbox","Value",null,null,null,null,null,null,null,null,1,null,{"$f":"'THCP xay dung'!E17","v":"T"},{"$f":"'THCP xay dung'!E18","v":"C"},{"$f":"'THCP xay dung'!E19","v":"TL"},{"$f":"'THCP xay dung'!E20","v":"G"},{"$f":"'THCP xay dung'!E21","v":"GTGT"},{"$f":"'THCP xay dung'!E22","v":"GXD"},{"$f":"'THCP xay dung'!E23","v":"GDP"},{"$f":"'THCP xay dung'!E24","v":"GGTXD"},null,"T","C","TL","G","GTGT","GLD","GDP","GGTXD"]
[null,"Các tùy chọn",null,null,"C:\\Du toan GXD\\Dulieu\\HaNoi\\HaNoi2015.mdb",null,null,null,null,null,{"$f":"'Du toan XD'!F9","v":"PHẦN MÓNG"},2,null,null,null,"Thiết bị",0,{"$f":"ROW('Tong hop kinh phi'!A24)","v":24},null,null,null,null,null,null,null,0,null,{"$f":"'THCP xay dung'!F17","v":0},{"$f":"'THCP xay dung'!F18","v":6.1515890015500056E-2},{"$f":"'THCP xay dung'!F19","v":5.5E-2},{"$f":"'THCP xay dung'!F20","v":0},{"$f":"'THCP xay dung'!F21","v":0.1},{"$f":"'THCP xay dung'!F22","v":0},{"$f":"'THCP xay dung'!F23","v":7.5554999999999997E-2},{"$f":"'THCP xay dung'!F24","v":0},null,{"$f":"'THCP Lap dat'!F17","v":0},{"$f":"'THCP Lap dat'!F18","v":6.1515890015500056E-2},{"$f":"'THCP Lap dat'!F19","v":5.5E-2},null,{"$f":"'THCP Lap dat'!F21","v":0.1},null,{"$f":"'THCP Lap dat'!F23","v":0}]
["CF_TDGTH","Tính đơn giá tổng hợp",1,null,null,null,null,null,null,null,{"$f":"'Du toan XD'!F14","v":"PHẦN THÂN"},{"$f":"'Du toan XD'!F8","v":0},null,null,null,"Công trình",0,null,null,null,null,null,null,null,null,null,null,{"$f":"'THCP xay dung'!F42","v":0},{"$f":"'THCP xay dung'!F43","v":6.1515890015500056E-2},{"$f":"'THCP xay dung'!F44","v":5.5E-2},{"$f":"'THCP xay dung'!F45","v":0},{"$f":"'THCP xay dung'!F46","v":0.1},{"$f":"'THCP xay dung'!F47","v":0},{"$f":"'THCP xay dung'!F48","v":7.5554999999999997E-2},{"$f":"'THCP xay dung'!F49","v":0}]
[2,"Tra lại tên công việc khi thay đổi mã đơn giá",1,null,null,null,null,null,null,null,null,null,null,null,null,"Mặc định",1]
[3,"Tính lại khi đơn giá khi thay đổi mã vữa",0,null,null,null,null,null,null,null,null,null,null,null,null,"Chi phí tư vấn",0]
[4,"Lựa chọn nhóm nhân công",1,null,null,null,null,null,null,null,null,null,null,null,null,"Xây dựng",0]
[5,"Sử dụng phụ lục vữa",0,null,null,null,null,null,null,null,null,null,null,null,null,"Thẩm tra",0]
[6,"Tính giá vật liệu hiện trường khi phân tích toàn bộ",0,null,null,null,null,null,null,null,null,null,null,null,null,"Tạm tính",0]
[7,"Tổng hợp theo tên vật tư",0,null,null,null,null,null,null,null,null,null,null,null,null,null,0]
[8,"Bóc thép theo diễn giải",0]
[9,"Phân tích đơn giá chi tiết theo vữa",0]
[10,"Tính ĐGCT theo đơn giá đầy đủ",0]
[11,"Dùng hệ số trong đơn giá chi tiết",1]
[12,"Chiết tính đơn giá hàng ngang",3]
[13,"Phân tích đơn giá khảo sát",0]
[14,"Chi phí trực tiếp/Chi phí nhân công (1: Giá trị được chọn; 0: giá trị bỏ chọn)",1]
[15,"Tính Giá ca máy",1]
[16,"Nối giá vật tư từ bảng Tổng hợp và Chênh lệch",0]
[17,"Nối giá vật tư từ bảng Giá trị vật tư",0]
[18,"Nối đơn giá với bảng Dự toán",0]
[19,"Nối giá vật liệu từ bảng Giá vật liệu đến hiện trường",1]
[20,"Nối giá nhân công từ bảng Lương nhân công",1]
[21,"Nối giá ca máy từ bảng Giá ca máy",1]
[22,"Nối giá vữa từ bảng Phụ lục vữa",1]
[23,"Nối giá vật liệu từ bảng Giá vật liệu đến hiện trường",0]
[24,"Nối giá nhân công từ bảng Lương nhân công",0]
[25,"Nối giá ca máy từ bảng Giá ca máy",0]
[26,"Nối giá vữa từ bảng Phụ lục vữa",0]
[27,"Đổi nhóm nhân công toàn bộ",0]
[28,"Tổng hợp dự toán theo dạng bảng",1]
[29,"Phương pháp lập dự toán",2]
[30,"Tùy chọn kết xuất dữ liệu",0]
[31,"Hiển thị trang tin khi khởi động",0]
["CF_DTGT","Tính dự toán gói thầu",0]
[null,"Các hệ số"]
["CF_HSVL","Hệ số vật liệu",{"$f":"Ts!O51","v":1}]
["CF_HSNC","Hệ số nhân công",{"$f":"Ts!O52","v":1}]
["CF_HSM","Hệ số máy xây dựng",{"$f":"Ts!O53","v":1}]
["CF_DGKL","Ẩn hiện diễn giải khối lượng",1]
[null,"Các định nghĩa trong phần mềm"]
["CF_TITILE_VL","Vật liệu"]
["CF_TITILE_VLP","Vật liệu phụ"]
["CF_TITILE_VLK","Vật liệu khác"]
["CF_TITILE_NC","Nhân công"]
["CF_TITILE_MTC","Máy thi công"]
["CF_TITILE_MK","Máy khác"]
[1,"Các dòng chi phí"]
[2,"Chi phí trực tiếp khác (TT)"]
[3,"Chi phí trực tiếp (T)"]
[4,"Chi phí chung (C)"]
[5,"Thu nhập chịu thuế tính trước (TL)"]
[6,"Chi phí xây dựng trước thuế (G)"]
[7,"Thuế giá trị gia tăng (GTGT)"]
[8,"Chi phí nhà tạm tại hiện trường để ở và điều hành thi công (GXDNT)"]
[9,"Chi phí xây dựng sau thuế (GXD)"]
[10,"Tổng cộng"]
[]
[11,"Giá thành khảo sát (G)"]
[12,"Chi phí lập phương án, báo cáo khảo sát (Gpa+Gbc)"]
[13,"Đơn giá khảo sát trước thuế (Gt)"]
[14,"Đơn giá khảo sát sau thuế (Gks)"]
[15,"Chi phí chỗ ở tạm thời (Gnt)"]
[16,"Chi phí chuyển máy, thiết bị (Gdc)"]
[17,"Chi phí dự phòng (GDP)"]
[18,"Chi phí trực tiếp (Ct)"]
[19,"Chi phí chung (P)"]
[20,"Thu nhập chịu thuế tính trước (Lt)"]
[null,"Tên bảng"]
[1,"Bảng dự toán","BẢNG DỰ TOÁN"]
[2,"Bảng tiên lượng","BẢNG TIÊN LƯỢNG"]
[3,"Bảng giá ca máy mới","BẢNG GIÁ CA MÁY VÀ THIẾT BỊ THI CÔNG XÂY DỰNG"]
[4,"Bảng giá ca máy tính theo phương pháp bù trực tiếp","BẢNG TÍNH BÙ GIÁ CA MÁY THEO PHƯƠNG PHÁP BÙ TRỰC TIẾP"]
[5,"Bảng giá ca máy đơn giản","BẢNG TÍNH BÙ GIÁ CA MÁY (ĐƠN GIẢN)"]
[6,"Bảng phân tích hao phí vật tư","PHÂN TÍCH HAO PHÍ VẬT TƯ THEO ĐỊNH MỨC"]
[7,"Bảng đơn giá chi tiết","BẢNG PHÂN TÍCH ĐƠN GIÁ CHI TIẾT"]
[]
[null,"Lập dự toán riêng"]
[]
["CF_CPD","Ẩn/hiện chi phí đuôi",1]
["CF_HIDE_NCM","Ẩn/hiện nhân công , máy",0]
["CF_TYPE_DG","Ẩn/hiện bảng phân tích vật tư",0]
["Hiện chi phí tư vấn",null,3]
["Hiện chi phí khác"]
["Hiện toàn bộ",null,0]
["Tên chi phí tư vấn",null,"CHI TIẾT CÁC CHI PHÍ TƯ VẤN"]
["Tên chi phí khác",null,"CHI TIẾT CÁC CHI PHÍ KHÁC"]
[null,null,"CHI TIẾT CÁC CHI PHÍ TƯ VẤN VÀ CHI PHÍ KHÁC"]
["Ẩn hiện DGTH"]
["Ẩn hiện vật tư XD",null,1]
[null,null,1]
["Ẩn hiện vật tư LD",null,1]
[null,null,1]
[null,null,"Công trình"]
[null,null,"Hạng mục"]
["[CF_GTHAU]","Đơn giá thầu",1]
["[CF_GTHAU]","Đồng bộ giá vật tư",1]
["Ký hiệu chuyên gia",null,"CG"]
["Ghi chú","Hiển thị khi lấy giá bên ĐGCT sang","Đơn giá địa phương chưa công bố"]
["[CF_TT]","Tạm tính"]
["[CF_TDNCXD]","Tùy chọn tính đơn giá nhân công (mặc định là tính theo TT01 sẽ bằng 0)",0]

{"sheet":"Ts","index":1,"n_rows":711,"n_cols":44,"rows_kept":711,"cut":false,"hidden":false,"merged":[[32,13,32,14],[34,13,34,14],[33,35,34,35],[33,34,34,34],[40,13,40,14],[35,13,35,14],[36,13,36,14],[37,13,37,14],[38,13,38,14],[39,13,39,14],[48,34,49,34],[48,35,49,35],[66,8,66,10],[33,13,33,14],[42,13,42,14],[45,13,45,14],[41,13,41,14],[44,13,44,14],[43,13,43,14]]}
[null,null,null,null,null,null,"CÁC THÔNG SỐ VỀ CÔNG TRÌNH",null,null,null,null,null,null,null,null,null,null,null,null,null,null,null,null,null,null,null,null,null,null,null,null,"tỉnh","huyện thị",null,null,null,null,{"$f":"ADDRESS(MATCH(K25,$AI$4:$AI$24)+ROW(AI4),COLUMN(AJ1))&\":\"&ADDRESS(MATCH(K25+1,$AI$4:$AI$24,0)+ROW(AI4)-2,COLUMN(AJ1))","v":"$AJ$5:$AJ$7"},{"$f":"ADDRESS(MATCH($K$25,$AI$4:$AI$24)+ROW(AI4),COLUMN(AK1))&\":\"&ADDRESS(MATCH($K$25+1,$AI$4:$AI$24,0)+ROW(AI4)-2,COLUMN(AK1))","v":"$AK$5:$AK$7"},{"$f":"ADDRESS(MATCH($K$25,$AI$4:$AI$24)+ROW(AJ4),COLUMN(AL1))&\":\"&ADDRESS(MATCH($K$25+1,$AI$4:$AI$24,0)+ROW(AJ4)-2,COLUMN(AL1))","v":"$AL$5:$AL$7"},{"$f":"ADDRESS(MATCH($K$25,$AI$4:$AI$24)+ROW(AK4),COLUMN(AM1))&\":\"&ADDRESS(MATCH($K$25+1,$AI$4:$AI$24,0)+ROW(AK4)-2,COLUMN(AM1))","v":"$AM$5:$AM$7"},{"$f":"ADDRESS(MATCH($K$25,$AI$4:$AI$24)+ROW(AL4),COLUMN(AN1))&\":\"&ADDRESS(MATCH($K$25+1,$AI$4:$AI$24,0)+ROW(AL4)-2,COLUMN(AN1))","v":"$AN$5:$AN$7"}]
[null,null,null,null,null,null,"THÔNG TIN CHUNG",null,null,null,null,null,null,null,null,null,null,null,null,null,null,null,null,null,null,null,null,null,null,null,null,1,2]
[null,null,null,null,null,null,null,null,null,null,null,null,null,null,null,null,null,null,null,null,null,null,null,null,null,null,null,null,null,null,null,null,null,null,"STT","LOẠI CÔNG TRÌNH","CKKL","Chi phí chung",null,"TN",null,1,"Thiết kế 1 bước"]
[null,null,null,null,null,null,null,"DỰ ÁN: ",null,null,"HỆ THỐNG PHẦN MỀM CHUYÊN NGÀNH XÂY DỰNG - GXD",null,null,null,null,null,null,null,null,null,null,null,null,null,"Tỉnh An Giang","Thành phố Châu Đốc","III",1,"Thành phố Hà Nội",1,{"$f":"INDEX($Y$4:$Z$711,MATCH(VLOOKUP($AF$2,$AB$4:$AC$66,2,0),$Y$4:$Y$711,0),2)","v":"Quận Hoàn Kiếm"},null,null,null,1,"Công trình dân dụng",null,null,null,null,null,2,"Thiết kế 2 bước"]
[null,null,null,null,null,null,null,null,null,null,null,null,null,null,null,null,null,null,null,null,null,null,null,null,"Tỉnh An Giang","Thành phố Long Xuyên","II",2,"Thành phố Hồ Chí Minh",2,{"$f":"IF(ROW(AE4)-2<=COUNTIF($Y$4:$Y$711,VLOOKUP($AF$2,$AB$4:$AC$66,2,0)),INDEX($Y$4:$Z$711,MATCH(AE4,$Z$4:$Z$711,0)+1,2),\"\")","v":"Quận Thanh Xuân"},null,null,1,null,"Thông thường",2.5,{"$f":"$AR$37","v":6.1515890015500059},"Định mức chi phí chung tính trên chi phí trực tiếp (C)",5.5,null,3,"Thiết kế 3 bước"]
[null,null,null,null,null,null,null,"CÔNG TRÌNH: ",null,null,"CÁC PHẦN MỀM QUẢN LÝ CHI PHÍ ĐTXD CT",null,null,null,null,null,null,null,null,null,null,null,null,null,"Tỉnh An Giang","Thị xã Tân Châu","III",3,"Thành Phố Hải Phòng",3,"Quận Ba Đình",null,null,2,null,"Công trình tu bổ, phục hồi di tích lịch sử, văn hóa",2.5,{"$f":"$AR$38","v":9.3031780031000118},"Định mức chi phí chung tính trên chi phí trực tiếp (C)",5.5,null,1,"Cấp đặc biệt"]
[null,null,null,null,null,null,null,null,null,null,null,null,null,null,null,null,null,null,null,null,null,null,null,null,"Tỉnh An Giang","Huyện An Phú","IV",4,"Thành phố Đà Nẵng",4,"Quận Hai Bà Trưng",null,null,3,null,"Thông thường",2.5,{"$f":"$AR$37","v":6.1515890015500059},"Định mức chi phí chung tính trên chi phí trực tiếp (C)",5.5,null,2,"Cấp I"]
[null,null,null,null,null,null,null,"HẠNG MỤC: ",null,null,"PHẦN MỀM DỰ TOÁN GXD 10",null,null,null,null,null,null,null,null,null,null,null,null,null,"Tỉnh An Giang","Huyện Phú Tân","IV",5,"Thành phố Cần Thơ",5,"Quận Đống Đa",null,null," ",2,"Công trình công nghiệp",null,null,null,null,null,3,"Cấp II"]
[null,null,null,null,null,null,null,null,null,null,null,null,null,null,null,null,null,null,null,null,null,null,null,"theo 122","Tỉnh An Giang","Huyện Châu Thành","III",6,"Tỉnh An Giang",6,"Quận Cầu Giấy",null,null,1,null,"Thông thường",2,{"$f":"$AR$39","v":5.1515890015500059},"Định mức chi phí chung tính trên chi phí trực tiếp (C)",6,null,4,"Cấp III"]
[null,null,null,null,null,null,null,"ĐỊA ĐIỂM:",null,null,"SỐ 2A/55 NGUYỄN NGỌC NẠI, THANH XUÂN, HÀ NỘI",null,null,null,null,null,null,null,null,null,null,null,null,null,"Tỉnh An Giang","Huyện Tịnh Biên","IV",7,"Tỉnh Bà Rịa-Vũng Tàu",7,"Quận Tây Hồ",null,null,2,null,"Công trình xây dựng hầm lò, hầm thủy điện",6.5,{"$f":"$AR$40","v":6.3606356006200029},"Định mức chi phí chung tính trên chi phí trực tiếp (C)",6,null,5,"Cấp IV"]
[null,null,null,null,null,null,null,null,null,null,null,null,null,null,null,null,null,null,null,null,null,null,null,null,"Tỉnh An Giang","Huyện Chợ Mới (AG)","IV",8,"Tỉnh Bạc Liêu",8,"Quận Nam Từ Liêm",null,null,3,null,"Công tác lắp đặt thiết bị công nghệ, thí nghiệm hiệu chỉnh đường dây và trạm biến áp",2,{"$f":"$AR$54","v":65},"Định mức chi phí chung tính trên chi phí nhân công (C)",6]
[null,null,null,null,null,null,null,"CHỦ ĐẦU TƯ:",null,null,"CÔNG TY CỔ PHẦN GIÁ XÂY DỰNG",null,null,null,null,null,null,null,null,null,null,null,null,"theo 122","Tỉnh An Giang","Huyện Châu Phú","III",9,"Tỉnh Bắc Giang",9,"Quận Hoàng Mai",null,null,null,3,"Công trình giao thông",null,null,null,null,null,"Phân loại công trình"]
[null,null,null,null,null,null,null,null,null,null,null,null,null,null,null,null,null,null,null,null,null,null,null,"theo 122","Tỉnh An Giang","Huyện Thoại Sơn","III",10,"Tỉnh Bắc Kạn",10,"Quận Bắc Từ Liêm",null,null,1,null,"Thông thường",2,{"$f":"$AR$41","v":5.1515890015500059},"Định mức chi phí chung tính trên chi phí trực tiếp (C)",6,null,{"$f":"VLOOKUP($K$25,$AI$4:$AJ$20,2,0)","v":"Công trình dân dụng"}]
[null,null,null,null,null,null,null,"ĐƠN VỊ THIẾT KẾ:",null,null,"PHÒNG NGHIÊN CỨU VÀ PHÁT TRIỂN GXD",null,null,null,null,null,null,null,null,null,null,null,null,null,"Tỉnh An Giang","Huyện Tri Tôn","IV",11,"Tỉnh Bắc Ninh",11,"Quận Hà Đông",null,null,2,null,"Công trình hầm giao thông",6.5,{"$f":"$AR$42","v":6.3606356006200029},"Định mức chi phí chung tính trên chi phí trực tiếp (C)",6,null,{"$f":"VLOOKUP($K$27,$AP$6:$AQ$10,2,0)","v":"Cấp IV"}]
[null,null,null,null,null,null,null,null,null,null,null,null,null,null,null,null,null,null,null,null,null,null,null,null,"Tỉnh Bà Rịa-Vũng Tàu","Thành phố Vũng Tàu","I",12,"Tỉnh Bến Tre",12,"Quận Long Biên",null,null,3,null,"Công tác duy tu sửa chữa thường xuyên đường bộ, đường sắt, đường thủy nội địa, hệ thống báo hiệu hàng hải và đường thủy nội địa",2,{"$f":"$AR$52","v":66},"Định mức chi phí chung tính trên chi phí nhân công (C)",6,null,{"$f":"VLOOKUP($K$28,$AP$3:$AQ$5,2,0)","v":"Thiết kế 2 bước"}]
[null,null,null,null,null,null,null,"ĐƠN VỊ THẨM TRA:",null,null,"Công ty Cổ phần HTT",null,null,null,null,null,null,null,null,null,null,null,null,null,"Tỉnh Bà Rịa-Vũng Tàu","Huyện Tân Thành","II",13,"Tỉnh Bình Dương",13,"Huyện Thanh Trì",null,null,null,4,"Công trình nông nghiệp và phát triển nông thôn"," "]
[null,null,null,null,null,null,null,null,null,null,null,null,null,null,null,null,null,null,null,null,null,null,null,null,"Tỉnh Bà Rịa-Vũng Tàu","Huyện Xuyên Mộc","III",14,"Tỉnh Bình Định",14,"Huyện Đan Phượng",null,null,1,null,"Thông thường",2,{"$f":"$AR$43","v":5.1515890015500059},"Định mức chi phí chung tính trên chi phí trực tiếp (C)",5.5]
[null,null,null,null,null,null,null,"HĐKT SỐ:",null,null,"137/2014-HĐKT-GXD-HTT",null,"NGÀY KÝ:","13 tháng 7 năm 2014",null,null,null,null,null,null,null,null,null,null,"Tỉnh Bà Rịa-Vũng Tàu","Huyện đảo Côn Đảo","III",15,"Tỉnh Bình Phước",15,"Huyện Hoài Đức",null,null,2,null,"Công tác đào, đắp đất công trình nông nghiệp và phát triển nông thôn bằng thủ công",2,{"$f":"$AR$53","v":51},"Định mức chi phí chung tính trên chi phí nhân công (C)",5.5]
[null,null,null,null,null,null,null,null,null,null,null,null,null,null,null,null,null,null,null,null,null,null,null,null,"Tỉnh Bà Rịa-Vũng Tàu","Huyện Long Điền","III",16,"Tỉnh Bình Thuận",16,"Thị xã Sơn Tây",null,null,3,null,"Thông thường",2,{"$f":"$AR$43","v":5.1515890015500059},"Định mức chi phí chung tính trên chi phí trực tiếp (C)",5.5]
[null,null,null,null,null,null,null,"ĐƠN VỊ THẨM ĐỊNH:",null,null,"Phòng tư vấn xây dựng GXD",null,null,null,null,null,null,null,null,null,null,null,null,null,"Tỉnh Bà Rịa-Vũng Tàu","Thành phố Bà Rịa","II",17,"Tỉnh Cà Mau",17,"Huyện Gia Lâm",null,null,null,5,"Công trình hạ tầng kỹ thuật"]
[null,null,null,null,null,null,null,null,null,null,null,null,null,null,null,null,null,null,null,null,null,null,null,null,"Tỉnh Bà Rịa-Vũng Tàu","Huyện Đất Đỏ","III",18,"Tỉnh Cao Bằng",18,"Huyện Phúc Thọ",null,null,1,null,"Thông thường",2,{"$f":"$AR$44","v":5},"Định mức chi phí chung tính trên chi phí trực tiếp (C)",5.5]
[null,null,null,null,null,null,null,null,null,null,null,null,null,null,null,null,null,null,null,null,null,null,null,null,"Tỉnh Bà Rịa-Vũng Tàu","Huyện Châu Đức","III",19,"Tỉnh Đăk Lăk",19,"Huyện Thanh Oai",null,null,2,null,"Thông thường",2,{"$f":"$AR$44","v":5},"Định mức chi phí chung tính trên chi phí trực tiếp (C)",5.5]
[null,null,null,null,null,null,"LOẠI, CẤP CÔNG TRÌNH, SỐ BƯỚC THIẾT KẾ, LOẠI BÁO CÁO…",null,null,null,null,null,null,null,null,null,null,null,null,null,null,null,null,null,"Tỉnh Bình Dương","Thị xã Dĩ An","I",20,"Tỉnh Đăk Nông",20,"Huyện Thường Tín",null,null,3,null,"Thông thường",2,{"$f":"$AR$44","v":5},"Định mức chi phí chung tính trên chi phí trực tiếp (C)",5.5]
[null,null,null,null,null,null,null,null,null,null,null,null,null,null,null,null,null,null,null,null,null,null,null,null,"Tỉnh Bình Dương","Thị xã Thuận An","I",21,"Tỉnh Điện Biên",21,"Huyện Mê Linh",null,null,null,6]
[null,null,null,null,null,null,null,"Loại công trình",null,null,1,null,null,null,null,null,null,null,null,null,null,null,null,null,"Tỉnh Bình Dương","Thị xã Tân Uyên","I",22,"Tỉnh Đồng Nai",22,"Huyện Quốc Oai"]
[null,null,null,null,null,null,null,null,null,null,1,null,null,null,null,null,null,null,null,null,null,null,null,null,"Tỉnh Bình Dương","Thành phố Thủ Dầu Một","I",23,"Tỉnh Đồng Tháp",23,"Huyện Phú Xuyên"]
[null,null,null,null,null,null,null,"Cấp công trình",null,null,5,null,null,null,null,null,null,null,null,null,null,null,null,null,"Tỉnh Bình Dương","Thị xã Bến Cát","I",24,"Tỉnh Gia Lai",24,"Huyện Đông Anh"]
[null,null,null,null,null,null,null,"Số bước thiết kế",null,null,2,null,null,{"$f":"IF(AND(baocao_=2,K28=1),\"\",IF(AND(baocao_=1,K28>1),\"\",IF(baocao_=1,\"BCNC khả thi không thể thiết kế 1 bước\",\"BCKTKT chỉ có 1 bước thiết kế\")))","v":""},null,null,null,null,null,null,null,null,null,null,"Tỉnh Bình Dương","Huyện Bàu Bàng","I",25,"Tỉnh Hà Giang",25,"Huyện Ứng Hòa"]
[null,null,null,null,null,null,null,"Loại báo cáo",null,null,1,null,null,null,null,null,null,null,null,null,null,null,null,null,"Tỉnh Bình Dương","Huyện Bắc Tân Uyên","I",26,"Tỉnh Hà Nam",26,"Huyện Thạch Thất"]
[null,null,null,null,null,null,null,null,null,null,null,null,null,null,null,null,null,null,null,null,null,null,null,null,"Tỉnh Bình Dương","Huyện Phú Giáo","II",27,"Tỉnh Hà Tĩnh",27,"Huyện Mỹ Đức",null,null,null,null,"Gt","Ga","Gb"]
[null,null,null,null,null,null,"THÔNG TIN VỀ TỔNG MỨC ĐẦU TƯ XÂY DỰNG",null,null,null,null,null,null,null,null,null,null,null,null,null,null,null,null,null,"Tỉnh Bình Dương","Huyện Dầu Tiếng","II",28,"Tỉnh Hải Dương",28,"Huyện Chương Mỹ",null,null,null,null,{"$f":"N34/10^9","v":74.229869736498898},{"$f":"IF($AJ$31<=15,$AK35,OFFSET($AK35,0,MATCH($AJ$31,$AK$35:$AO$35,1)-1))","v":15},{"$f":"IF($AJ$31<=15,$AK35,IF($AJ$31>1000,$AO35,OFFSET($AK35,0,MATCH($AJ$31,$AK$35:$AO$35,1))))","v":100}]
[null,null,null,null,null,null,null,null,null,null,null,null,null,null,null,null,null,null,null,null,null,null,null,null,"Tỉnh Bình Phước","Thị xã Phước Long","III",29,"Tỉnh Hậu Giang",29,"Huyện Sóc Sơn",null,null,null,"Bảng 3.7: ĐỊNH MỨC CHI PHÍ CHUNG TÍNH TRÊN CHI PHÍ TRỰC TIẾP"]
[null,null,null,null,null,null,null,"Tổng mức đầu tư xây dựng:",null,null,null,null,null,null,null,null,"Giá trị tính ra sau khi thử","Hiệu giữ giá trị tính ra và giá trị đưa vào thử",null,null,null,null,null,null,"Tỉnh Bình Phước","Thị xã Bình Long","III",30,"Tỉnh Hòa Bình",30,"Huyện Ba Vì",null,null,null,null,null,null,null,null,null,null,null,"       Đơn vị tính:  %"]
[null,null,null,null,null,null,null,"Chi phí xây dựng trước thuế:",null,null,null,null,null,{"$f":"S50","v":74229869736.498901},null,null,{"$f":"GXDtt","v":74229869753.525879},{"$f":"Q34-N34","v":17.0269775390625},"Số lần thử",null,null,null,null,null,"Tỉnh Bình Phước","Thị xã Đồng Xoài","II",31,"Tỉnh Hưng Yên",null,null,null,null,null,"TT","Loại công trình","Chi phí XD trước thuế trong TMĐT xây dựng của DA được duyệt (tỷ đồng)",null,null,null,null,"Ka","Kb","DMTL"]
[null,null,null,null,null,null,null,"Chi phí thiết bị:",null,null,null,null,null,null,null,null,null,null,null,null,null,null,null,null,"Tỉnh Bình Phước","Huyện Bù Đốp","IV",32,"Tỉnh Kiên Giang","Mức lương cơ sở đầu vào theo PL1 - Thông tư 05/2016/TT-BXD",null,null,null,null,null,null,15,100,500,1000,1000]
[null,null,null,null,null,null,null,"Chi phí quản lý dự án:",null,null,null,null,null,null,null,null,null,null,null,null,null,null,null,null,"Tỉnh Bình Phước","Huyện Chơn Thành","II",33,"Tỉnh Kon Tum","Vùng I","2.350.000 ÷ 2.530.000",null,null,null,"[1]","[2]","[3]","[4]","[5]","[6]","[7]"]
[null,null,null,null,null,null,null,"Chi phí tư vấn:",null,null,null,null,null,null,null,null,null,null,null,null,null,null,null,null,"Tỉnh Bình Phước","Huyện Hớn Quản","III",34,"Tỉnh Khánh Hòa","Vùng II","2.150.000 ÷ 2.320.000",null,null,null,1,"Công trình dân dụng",6.5,6,5.6,5.4,5.2,{"$f":"IF($AJ$31<=15,$AK37,OFFSET($AK37,0,MATCH($AJ$31,$AK$35:$AO$35,1)-1))","v":6.5},{"$f":"IF($AJ$31<=15,$AK37,OFFSET($AK37,0,MATCH($AJ$31,$AK$35:$AO$35,1)))","v":6},{"$f":"IF($AJ$31 <=10,AK37,IF($AJ$31>1000,AO37,FORECAST($AJ$31,AP37:AQ37,$AK$31:$AL$31)))","v":6.1515890015500059}]
[null,null,null,null,null,null,null,"Chi phí khác:",null,null,null,null,null,null,null,null,null,null,null,null,null,null,null,null,"Tỉnh Bình Phước","Huyện Lộc Ninh","IV",35,"Tỉnh Lai Châu","Vùng III","2.000.000 ÷ 2.154.000",null,null,null,null,"Riêng công trình tu bổ, phục hồi di tích lịch sử, văn hoá",10,9,8.6,8.4,8.1999999999999993,10,9,9.3031780031000118]
[null,null,null,null,null,null,null,"Chi phí dự phòng:",null,null,null,null,null,null,null,null,null,null,null,null,null,null,null,null,"Tỉnh Bình Phước","Huyện Đồng Phú","III",36,"Tỉnh Lạng Sơn","Vùng IV","1.900.000 ÷ 2.050.000",null,null,null,2,"Công trình công nghiệp",5.5,5,4.5999999999999996,4.4000000000000004,4.2,5.5,5,5.1515890015500059]
[null,null,null,null,null,null,null,"Chi phí bồi thường, hỗ trợ và tái định cư",null,null,null,null,null,null,null,null,null,null,null,null,null,null,null,null,"Tỉnh Bình Phước","Huyện Bù Đăng","IV",37,"Tỉnh Lào Cai",null,null,null,null,null,null,"Riêng công trình xây dựng đường hầm, hầm lò",6.5,6.3,6,5.8,5.7,6.5,6.3,6.3606356006200029]
[null,null,null,null,null,null,null,"Tổng mức đầu tư sau khi trừ biến phí:",null,null,null,null,null,{"$f":"N33-N42","v":0},null,null,null,null,null,null,null,null,null,null,"Tỉnh Bình Phước","Huyện Bù Gia Mập","IV",38,"Tỉnh Lâm Đồng",null,null,null,null,null,3,"Công trình giao thông",5.5,5,4.5999999999999996,4.4000000000000004,4.2,5.5,5,5.1515890015500059]
[null,null,null,null,null,null,null,"Các khoản biến phí:",null,null,null,null,null,{"$f":"N39+N40+SUM(N43:N46)","v":0},null,null,null,null,null,null,null,null,null,null,"Tỉnh Bình Thuận","Huyện đảo Phú Quý","IV",39,"Tỉnh Long An",null,null,null,null,null,null,"Riêng công trình hầm giao thông",6.5,6.3,6,5.8,5.7,6.5,6.3,6.3606356006200029]
[null,null,null,null,null,null,null,"Chi phí đánh giá tác động môi trường",null,null,null,null,null,null,null,null,null,null,null,null,null,null,null,null,"Tỉnh Bình Thuận","Thị xã La Gi","III",40,"Tỉnh Nam Định",null,null,null,null,null,4,"Công trình nông nghiệp và phát triển nông thôn",5.5,5,4.5999999999999996,4.4000000000000004,4.2,5.5,5,5.1515890015500059]
[null,null,null,null,null,null,null,"Lệ phí thẩm định tổng dự toán",null,null,null,null,null,null,null,null,null,null,null,null,null,null,null,null,"Tỉnh Bình Thuận","Thành phố Phan Thiết","II",41,"Tỉnh Ninh Bình",null,null,null,null,null,5,"Công trình hạ tầng kỹ thuật",5,5,4.0999999999999996,3.9,3.7,5,5,5]
[null,null,null,null,null,null,null,"…",null,null,null,null,null,null,null,null,null,null,null,null,null,null,null,null,"Tỉnh Bình Thuận","Huyện Đức Linh","IV",42,"Tỉnh Ninh Thuận"]
[null,null,null,null,null,null,null,null,null,null,null,null,null,null,null,null,null,null,null,null,null,null,null,null,"Tỉnh Bình Thuận","Huyện Hàm Tân","IV",43,"Tỉnh Nghệ An"]
[null,null,null,null,null,null,null,"Quy mô dự án",null,null,9000,"m2 sàn",null,null,null,null,null,null,74473507208.969543,"lần 1",null,null,null,null,"Tỉnh Bình Thuận","Huyện Tuy Phong","IV",44,"Tỉnh Phú Thọ",null,null,null,null,null,"Bảng 3.8: ĐỊNH MỨC CHI PHÍ CHUNG TÍNH TRÊN CHI PHÍ NHÂN CÔNG"]
[null,null,null,null,null,null,null,null,null,null,null,null,null,null,null,null,null,null,74228867569.761047,"lần 2",null,null,null,null,"Tỉnh Bình Thuận","Huyện Hàm Thuận Nam","III",45,"Tỉnh Phú Yên"]
[null,null,null,null,null,null,"CÁC HỆ SỐ, ĐỊNH MỨC TỶ LỆ",null,null,null,null,null,null,null,null,null,null,null,74229873875.860687,"lần 3",null,null,null,null,"Tỉnh Bình Thuận","Huyện Tánh Linh","IV",46,"Tỉnh Quảng Bình",null,null,null,null,null,"TT","Loại công tác","Chi phí nhân công trong chi phí trực tiếp (tỷ đồng)",null,null,null,null,"Ka","Kb","DMTL"]
[null,null,null,null,null,null,null,null,null,null,null,null,null,null,null,null,null,null,74229869736.498901,"lần 4",null,null,null,null,"Tỉnh Bình Thuận","Huyện Hàm Thuận Bắc","III",47,"Tỉnh Quảng Nam",null,null,null,null,null,null,null,15,100,100]
[null,null,null,null,null,null,null,"Hệ số vật liệu",null,null,null,null,null,null,1,null,null,null,null,null,null,null,null,null,"Tỉnh Bình Thuận","Huyện Bắc Bình","IV",48,"Tỉnh Quảng Ninh",null,null,null,null,null,"[1]","[2]","[3]","[4]","[5]"]
[null,null,null,null,null,null,null,"Hệ số nhân công",null,null,null,null,null,null,1,null,null,null,null,null,null,null,null,null,"Tỉnh Bình Định","Huyện Tuy Phước","IV",49,"Tỉnh Quảng Ngãi",null,null,null,null,null,1,"Công tác duy tu sửa chữa đường bộ, đường sắt, đường thuỷ nội địa, hệ thống báo hiệu hàng hải và đường thuỷ nội địa",66,60,56,56,null,{"$f":"IF($AP$56<=15,$AK52,OFFSET($AK52,0,MATCH($AP$56,$AK$50:$AM$50,1)-1))","v":66},{"$f":"IF($AP$56<=15,$AK52,OFFSET($AK52,0,MATCH($AP$56,$AK$50:$AM$50,1)))","v":66},{"$f":"IF($AP$56 <=15,AK52,IF($AP$56>100,AM52,FORECAST($AP$56,AP52:AQ52,$AQ$56:$AR$56)))","v":66}]
[null,null,null,null,null,null,null,"Hệ số máy xây dựng",null,null,null,null,null,null,1,null,null,null,null,null,null,null,null,null,"Tỉnh Bình Định","Thị xã An Nhơn","IV",50,"Tỉnh Quảng Trị",null,null,null,null,null,2,"Công tác đào, đắp đất công trình nông nghiệp và phát triển nông thôn hoàn toàn bằng thủ công",51,45,42,42,null,{"$f":"IF($AP$56<=15,$AK53,OFFSET($AK53,0,MATCH($AP$56,$AK$50:$AM$50,1)-1))","v":51},{"$f":"IF($AP$56<=15,$AK53,OFFSET($AK53,0,MATCH($AP$56,$AK$50:$AM$50,1)))","v":51},{"$f":"IF($AP$56 <=15,AK53,IF($AP$56>100,AM53,FORECAST($AP$56,AP53:AQ53,$AQ$56:$AR$56)))","v":51}]
[null,null,null,null,null,null,null,{"$f":"INDEX(INDIRECT($AO$1),$K$26)","v":"Định mức chi phí chung tính trên chi phí trực tiếp (C)"},null,null,null,null,null,null,{"$f":"INDEX(INDIRECT($AN$1),$K$26)/100","v":6.1515890015500056E-2},null,null,null,null,null,null,null,null,null,"Tỉnh Bình Định","Thành phố Qui Nhơn","III",51,"Tỉnh Sóc Trăng",null,null,null,null,null,3,"Công tác lắp đặt thiết bị công nghệ trong các công trình xây dựng, công tác xây lắp đường dây, thí nghiệm hiệu chỉnh điện đường dây và trạm biến áp, thí nghiệm vật liệu, cấu kiện và kết cấu xây dựng",65,59,55,55,null,65,65,65]
[null,null,null,null,null,null,null,"Định mức thu nhập chịu thuế tính trước (TL)",null,null,null,null,null,null,{"$f":"INDEX(INDIRECT($AP$1),$K$26)/100","v":5.5E-2},null,null,null,null,null,null,null,null,null,"Tỉnh Bình Định","Huyện Hoài Nhơn","IV",52,"Tỉnh Sơn La",null,null,null,null,null,null,null,null,null,null,null,null,"Gt","Ga","Gb"]
[null,null,null,null,null,null,null,"Thuế suất thuế giá trị gia tăng (TGTGT-XD)",null,null,null,null,null,null,0.1,null,null,null,null,null,null,null,null,null,"Tỉnh Bình Định","Huyện Phù Mỹ","IV",53,"Tỉnh Tây Ninh",null,null,null,null,null,null,null,null,null,null,null,null,{"$f":"THCP_NC/10^9","v":12.476842190999999},{"$f":"IF($AP$56<=15,$AK50,OFFSET($AK50,0,MATCH($AP$56,$AK$50:$AM$50,1)-1))","v":15},{"$f":"IF(AP56<=15,$AK50,IF($AP$56>100,$AM50,OFFSET($AK50,0,MATCH($AP$56,$AK$50:$AM$50,1))))","v":15}]
[null,null,null,null,null,null,null,"Định mức chi phí một số công tác không xác định được khối lượng từ thiết kế (CKKL)",null,null,null,null,null,null,{"$f":"INDEX(INDIRECT($AM$1),$K$26)/100","v":2.5000000000000001E-2},null,null,null,null,null,null,null,null,null,"Tỉnh Bình Định","Huyện Phù Cát","IV",54,"Tỉnh Tiền Giang"]
[null,null,null,null,null,null,null,"Định mức chi phí xây dựng nhà tạm tại hiện trường để ở và điều hành thi công (CNT)",null,null,null,null,null,null,0.01,null,null,null,null,null,null,null,null,null,"Tỉnh Bình Định","Huyện Tây Sơn","IV",55,"Tỉnh Tuyên Quang"]
[null,null,null,null,null,null,null,null,null,null,null,null,null,null,null,null,null,null,null,null,null,null,null,null,"Tỉnh Bình Định","Huyện An Lão ","IV",56,"Tỉnh Thái Bình"]
[null,null,null,null,null,null,"CHẾ ĐỘ TIỀN LƯƠNG - GIÁ NHIÊN LIỆU, NĂNG LƯỢNG (TRƯỚC VAT)",null,null,null,null,null,null,null,null,null,null,null,null,null,null,null,null,null,"Tỉnh Bình Định","Huyện Vĩnh Thạnh","IV",57,"Tỉnh Thái Nguyên"]
[null,null,null,null,null,null,null,null,null,null,null,null,null,null,null,null,null,null,null,null,null,null,null,null,"Tỉnh Bình Định","Huyện Hoài Ân","IV",58,"Tỉnh Thanh Hóa"]
[null,null,null,null,null,null,null,"Địa phương:",null,null,1,null,null,null,{"$f":"\"Vùng \"&VLOOKUP(VLOOKUP($AG$2,$AD$4:$AE$33,2,0),$Z$4:$AA$711,2,0)","v":"Vùng I"},null,null,null,null,null,null,null,null,null,"Tỉnh Bình Định","Huyện Vân Canh","IV",59,"Tỉnh Thừa Thiên-Huế"]
[null,null,null,null,null,null,null,null,null,null,null,null,null,null,null,null,null,null,null,null,null,null,null,null,"Tỉnh Bạc Liêu","Thành phố Bạc Liêu","III",60,"Tỉnh Trà Vinh"]
[null,null,null,null,null,null,null,"Mức lương cơ sở đầu vào để xác định đơn giá nhân công theo Thông tư số 05/2016/TT-BXD",null,null,null,null,null,null,null,null,null,null,null,null,null,null,null,null,"Tỉnh Bạc Liêu","Huyện Vĩnh Lợi","IV",61,"Tỉnh Vĩnh Long"]
[null,null,null,null,null,null,null,null,{"$f":"VLOOKUP($O$62,$AD$36:$AE$39,2,0)","v":"2.350.000 ÷ 2.530.000"},null,null,"đồng/tháng",null,null,null,null,null,null,null,null,null,null,null,"theo 122","Tỉnh Bạc Liêu","Thị xã Giá Rai","III",62,"Tỉnh Vĩnh Phúc"]
[null,null,null,null,null,null,null,"Căn cứ vào Văn  bản hướng dẫn của địa phương, nhập mức lương cơ sở đầu vào ô dưới đây",null,null,null,null,null,null,null,null,null,null,null,null,null,null,null,null,"Tỉnh Bạc Liêu","Huyện Phước Long","IV",63,"Tỉnh Yên Bái"]
[null,null,null,null,null,null,null,null,null,null,null,"đồng/tháng",null,null,null,null,null,null,null,null,null,null,null,null,"Tỉnh Bạc Liêu","Huyện Hoà Bình","IV"]
[null,null,null,null,null,null,null,null,null,null,null,null,null,null,null,null,null,null,null,null,null,null,null,null,"Tỉnh Bạc Liêu","Huyện Hồng Dân","IV"]
[null,null,null,null,null,null,null,null,"Mức lương tối thiểu chung (LTTC)",null,null,null,null,1050000,"đ/tháng",null,null,null,null,null,null,null,null,null,"Tỉnh Bạc Liêu","Huyện Đông Hải","IV"]
[null,null,null,null,null,null,null,null,"Mức lương tối thiểu vùng (LTTV)",null,null,null,null,2000000,"đ/tháng",null,null,null,null,null,null,null,null,null,"Tỉnh Bắc Giang","Thành phố Bắc Giang","III"]
[null,null,null,null,null,null,null,null,"Phụ cấp lưu động (%LTTC)",null,null,null,null,0.2,null,null,null,null,null,null,null,null,null,null,"Tỉnh Bắc Giang","Huyện Việt Yên","III"]
[null,null,null,null,null,null,null,null,"Lương phụ (%LCB)",null,null,null,null,0.12,null,null,null,null,null,null,null,null,null,null,"Tỉnh Bắc Giang","Huyện Yên Dũng","III"]
[null,null,null,null,null,null,null,null,"Chi phí khoán trực tiếp (%LCB)",null,null,null,null,0.04,null,null,null,null,null,null,null,null,null,null,"Tỉnh Bắc Giang","Huyện Hiệp Hòa","III"]
[null,null,null,null,null,null,null,null,"Phụ cấp không ổn định sản xuất (%LCB)",null,null,null,null,null,null,null,null,null,null,null,null,null,null,null,"Tỉnh Bắc Giang","Huyện Tân Yên","III"]
[null,null,null,null,null,null,null,null,"Phụ cấp khu vực (%LTTC)",null,null,null,null,null,null,null,null,null,null,null,null,null,null,null,"Tỉnh Bắc Giang","Huyện Lạng Giang","III"]
[null,null,null,null,null,null,null,null,"Phụ cấp thu hút (%LCB)",null,null,null,null,null,null,null,null,null,null,null,null,null,null,null,"Tỉnh Bắc Giang","Huyện Yên Thế","IV"]
[null,null,null,null,null,null,null,null,"Phụ cấp độc hại (%LTTC)",null,null,null,null,null,null,null,null,null,null,null,null,null,null,null,"Tỉnh Bắc Giang","Huyện Lục Nam","IV"]
[null,null,null,null,null,null,null,null,"Phụ cấp đặc biệt (%LCB)",null,null,null,null,null,null,null,null,null,null,null,null,null,null,null,"Tỉnh Bắc Giang","Huyện Sơn Động","IV"]
[null,null,null,null,null,null,null,null,"Phụ cấp làm ca đêm (%LCB)",null,null,null,null,null,null,null,null,null,null,null,null,null,null,null,"Tỉnh Bắc Giang","Huyện Lục Ngạn","IV"]
[null,null,null,null,null,null,null,null,null,null,null,null,null,null,null,null,null,null,null,null,null,null,null,null,"Tỉnh Bắc Kạn","Thị xã Bắc Kạn","IV"]
[null,null,null,null,null,null,null,null,"Giá xăng",null,null,null,null,19909,null,null,null,null,null,null,null,null,null,null,"Tỉnh Bắc Kạn","Huyện Pác Nặm","IV"]
[null,null,null,null,null,null,null,null,"Giá dầu Diezel",null,null,null,null,19545,null,null,null,null,null,null,null,null,null,null,"Tỉnh Bắc Kạn","Huyện Bạch Thông","IV"]
[null,null,null,null,null,null,null,null,"Giá dầu Mazut",null,null,null,null,12000,null,null,null,null,null,null,null,null,null,null,"Tỉnh Bắc Kạn","Huyện Chợ Mới","IV"]
[null,null,null,null,null,null,null,null,"Giá điện",null,null,null,null,1622.01,null,null,null,null,null,null,null,null,null,null,"Tỉnh Bắc Kạn","Huyện Ngân Sơn","IV"]
[null,null,null,null,null,null,"CÁC CHỈ TIÊU KINH TẾ",null,null,null,null,null,null,null,null,null,null,null,null,null,null,null,null,null,"Tỉnh Bắc Kạn","Huyện Ba Bể","IV"]
[null,null,null,null,null,null,null,null,null,null,null,null,null,null,null,null,null,null,null,null,null,null,null,null,"Tỉnh Bắc Kạn","Huyện Na Rì","IV"]
[null,null,null,null,null,null,null,"Dự toán xây dựng công trình",null,null,null,{"$f":"'Tong hop kinh phi'!H24","v":92057586000},{"$f":"IF(L87<>0,\"đồng\",\"\")","v":"đồng"},null,null,null,null,null,null,null,null,null,null,null,"Tỉnh Bắc Kạn","Huyện Chợ Đồn","IV"]
[null,null,null,null,null,null,null,"Suất vốn đầu tư:",null,null,null,{"$f":"ROUND(L87/(K47*1000000),3)","v":10.228999999999999},{"$f":"IF(L88<>0,\"triệu đồng/\"&L47,\"\")","v":"triệu đồng/m2 sàn"},null,null,null,null,null,null,null,null,null,null,null,"Tỉnh Bắc Ninh","Thị xã Từ Sơn","II"]
[null,null,null,null,null,null,null,"Suất chi phí phần xây dựng:",null,null,null,{"$f":"ROUND('Tong hop kinh phi'!H8/(K47*1000000),3)","v":9.0730000000000004},{"$f":"IF(L89<>0,\"triệu đồng/\"&L47,\"\")","v":"triệu đồng/m2 sàn"},null,null,null,null,null,null,null,null,null,null,null,"Tỉnh Bắc Ninh","Thành phố Bắc Ninh","II"]
[null,null,null,null,null,null,null,"Suất chi phí phần thiết bị:",null,null,null,{"$f":"ROUND('Tong hop kinh phi'!H11/(K47*1000000),3)","v":0},{"$f":"IF(L90<>0,\"triệu đồng/\"&L47,\"\")","v":""},null,null,null,null,null,null,null,null,null,null,null,"Tỉnh Bắc Ninh","Huyện Yên Phong","II"]
[null,null,null,null,null,null,null,null,null,null,null,null,null,null,null,null,null,null,null,null,null,null,null,null,"Tỉnh Bắc Ninh","Huyện Tiên Du","II"]
[null,null,null,null,null,null,null,"Tỷ trọng các khoản mục chi phí trong chi phí trực tiếp phần Xây dựng",null,null,null,null,null,null,null,null,null,null,null,null,null,null,null,null,"Tỉnh Bắc Ninh","Huyện Lương Tài","III"]
[null,null,null,null,null,null,null,"Tỷ trọng các khoản mục chi phí trong chi phí trực tiếp phần Lắp đặt thiết bị",null,null,null,null,null,null,null,null,null,null,null,null,null,null,null,null,"Tỉnh Bắc Ninh","Huyện Gia Bình","III"]
[null,null,null,null,null,null,null,null,null,null,null,null,null,null,null,null,null,null,null,null,null,null,null,null,"Tỉnh Bắc Ninh","Huyện Thuận Thành","II"]
[null,null,null,null,null,null,null,null,null,null,null,null,null,null,null,null,null,null,null,null,null,null,null,null,"Tỉnh Bắc Ninh","Huyện Quế Võ","II"]
[null,null,null,null,null,null,null,null,null,null,null,null,null,null,null,null,null,null,null,null,null,null,null,null,"Tỉnh Bến Tre","Thành phố Bến Tre","III"]
[null,null,null,null,null,null,null,null,null,null,null,null,null,null,null,null,null,null,null,null,null,null,null,null,"Tỉnh Bến Tre","Huyện Mỏ Cày Bắc","IV"]
[null,null,null,null,null,null,null,null,null,null,null,null,null,null,null,null,null,null,null,null,null,null,null,null,"Tỉnh Bến Tre","Huyện Chợ Lách","IV"]
[null,null,null,null,null,null,null,null,null,null,null,null,null,null,null,null,null,null,null,null,null,null,null,null,"Tỉnh Bến Tre","Huyện Mỏ Cày Nam","IV"]
[null,null,null,null,null,null,null,null,null,null,null,null,null,null,null,null,null,null,null,null,null,null,null,null,"Tỉnh Bến Tre","Huyện Châu Thành (BTr)","III"]
[null,null,null,null,null,null,null,null,null,null,null,null,null,null,null,null,null,null,null,null,null,null,null,null,"Tỉnh Bến Tre","Huyện Giồng Trôm","IV"]
[null,null,null,null,null,null,null,null,null,null,null,null,null,null,null,null,null,null,null,null,null,null,null,null,"Tỉnh Bến Tre","Huyện Ba Tri","IV"]
[null,null,null,null,null,null,null,null,null,null,null,null,null,null,null,null,null,null,null,null,null,null,null,null,"Tỉnh Bến Tre","Huyện Bình Đại","IV"]
[null,null,null,null,null,null,null,null,null,null,null,null,null,null,null,null,null,null,null,null,null,null,null,null,"Tỉnh Bến Tre","Huyện Thạnh Phú","IV"]
[null,null,null,null,null,null,null,null,null,null,null,null,null,null,null,null,null,null,null,null,null,null,null,null,"Tỉnh Cao Bằng","Thành phố Cao Bằng","III"]
[null,null,null,null,null,null,null,null,null,null,null,null,null,null,null,null,null,null,null,null,null,null,null,null,"Tỉnh Cao Bằng","Huyện Phục Hòa","IV"]
[null,null,null,null,null,null,null,null,null,null,null,null,null,null,null,null,null,null,null,null,null,null,null,null,"Tỉnh Cao Bằng","Huyện Trà Lĩnh","IV"]
[null,null,null,null,null,null,null,null,null,null,null,null,null,null,null,null,null,null,null,null,null,null,null,null,"Tỉnh Cao Bằng","Huyện Thông Nông","IV"]
[null,null,null,null,null,null,null,null,null,null,null,null,null,null,null,null,null,null,null,null,null,null,null,null,"Tỉnh Cao Bằng","Huyện Quảng Uyên","IV"]
[null,null,null,null,null,null,null,null,null,null,null,null,null,null,null,null,null,null,null,null,null,null,null,null,"Tỉnh Cao Bằng","Huyện Hà Quảng","IV"]
[null,null,null,null,null,null,null,null,null,null,null,null,null,null,null,null,null,null,null,null,null,null,null,null,"Tỉnh Cao Bằng","Huyện Hạ Lang","IV"]
[null,null,null,null,null,null,null,null,null,null,null,null,null,null,null,null,null,null,null,null,null,null,null,null,"Tỉnh Cao Bằng","Huyện Trùng Khánh","IV"]
[null,null,null,null,null,null,null,null,null,null,null,null,null,null,null,null,null,null,null,null,null,null,null,null,"Tỉnh Cao Bằng","Huyện Hòa An","IV"]
[null,null,null,null,null,null,null,null,null,null,null,null,null,null,null,null,null,null,null,null,null,null,null,null,"Tỉnh Cao Bằng","Huyện Thạch An","IV"]
[null,null,null,null,null,null,null,null,null,null,null,null,null,null,null,null,null,null,null,null,null,null,null,null,"Tỉnh Cao Bằng","Huyện Nguyên Bình","IV"]
[null,null,null,null,null,null,null,null,null,null,null,null,null,null,null,null,null,null,null,null,null,null,null,null,"Tỉnh Cao Bằng","Huyện Bảo Lâm","IV"]
[null,null,null,null,null,null,null,null,null,null,null,null,null,null,null,null,null,null,null,null,null,null,null,null,"Tỉnh Cao Bằng","Huyện Bảo Lạc","IV"]
[null,null,null,null,null,null,null,null,null,null,null,null,null,null,null,null,null,null,null,null,null,null,null,null,"Tỉnh Cà Mau","Thành phố Cà Mau","II"]
[null,null,null,null,null,null,null,null,null,null,null,null,null,null,null,null,null,null,null,null,null,null,null,null,"Tỉnh Cà Mau","Huyện Cái Nước","III"]
[null,null,null,null,null,null,null,null,null,null,null,null,null,null,null,null,null,null,null,null,null,null,null,null,"Tỉnh Cà Mau","Huyện Phú Tân ","IV"]
[null,null,null,null,null,null,null,null,null,null,null,null,null,null,null,null,null,null,null,null,null,null,null,null,"Tỉnh Cà Mau","Huyện Năm Căn","III"]
[null,null,null,null,null,null,null,null,null,null,null,null,null,null,null,null,null,null,null,null,null,null,null,null,"Tỉnh Cà Mau","Huyện Thới Bình","IV"]
[null,null,null,null,null,null,null,null,null,null,null,null,null,null,null,null,null,null,null,null,null,null,null,null,"Tỉnh Cà Mau","Huyện Trần Văn Thời","III"]
[null,null,null,null,null,null,null,null,null,null,null,null,null,null,null,null,null,null,null,null,null,null,null,null,"Tỉnh Cà Mau","Huyện Ngọc Hiển","IV"]
[null,null,null,null,null,null,null,null,null,null,null,null,null,null,null,null,null,null,null,null,null,null,null,null,"Tỉnh Cà Mau","Huyện U Minh","III"]
[null,null,null,null,null,null,null,null,null,null,null,null,null,null,null,null,null,null,null,null,null,null,null,null,"Tỉnh Cà Mau","Huyện Đầm Dơi","IV"]
[null,null,null,null,null,null,null,null,null,null,null,null,null,null,null,null,null,null,null,null,null,null,null,null,"Thành phố Cần Thơ","Quận Ninh Kiều","II"]
[null,null,null,null,null,null,null,null,null,null,null,null,null,null,null,null,null,null,null,null,null,null,null,null,"Thành phố Cần Thơ","Quận Cái Răng","II"]
[null,null,null,null,null,null,null,null,null,null,null,null,null,null,null,null,null,null,null,null,null,null,null,null,"Thành phố Cần Thơ","Quận Bình Thủy","II"]
[null,null,null,null,null,null,null,null,null,null,null,null,null,null,null,null,null,null,null,null,null,null,null,null,"Thành phố Cần Thơ","Quận Thốt Nốt","II"]
[null,null,null,null,null,null,null,null,null,null,null,null,null,null,null,null,null,null,null,null,null,null,null,null,"Thành phố Cần Thơ","Huyện Phong Điền","III"]
[null,null,null,null,null,null,null,null,null,null,null,null,null,null,null,null,null,null,null,null,null,null,null,null,"Thành phố Cần Thơ","Quận Ô Môn","II"]
[null,null,null,null,null,null,null,null,null,null,null,null,null,null,null,null,null,null,null,null,null,null,null,null,"Thành phố Cần Thơ","Huyện Thới Lai","III"]
[null,null,null,null,null,null,null,null,null,null,null,null,null,null,null,null,null,null,null,null,null,null,null,null,"Thành phố Cần Thơ","Huyện Vĩnh Thạnh ","III"]
[null,null,null,null,null,null,null,null,null,null,null,null,null,null,null,null,null,null,null,null,null,null,null,null,"Thành phố Cần Thơ","Huyện Cờ Đỏ","III"]
[null,null,null,null,null,null,null,null,null,null,null,null,null,null,null,null,null,null,null,null,null,null,null,null,"Tỉnh Gia Lai","Thị xã An Khê","IV"]
[null,null,null,null,null,null,null,null,null,null,null,null,null,null,null,null,null,null,null,null,null,null,null,null,"Tỉnh Gia Lai","Thành phố Pleiku","III"]
[null,null,null,null,null,null,null,null,null,null,null,null,null,null,null,null,null,null,null,null,null,null,null,null,"Tỉnh Gia Lai","Thị xã Ayun Pa","IV"]
[null,null,null,null,null,null,null,null,null,null,null,null,null,null,null,null,null,null,null,null,null,null,null,null,"Tỉnh Gia Lai","Huyện Phú Thiện","IV"]
[null,null,null,null,null,null,null,null,null,null,null,null,null,null,null,null,null,null,null,null,null,null,null,null,"Tỉnh Gia Lai","Huyện Đắk Pơ","IV"]
[null,null,null,null,null,null,null,null,null,null,null,null,null,null,null,null,null,null,null,null,null,null,null,null,"Tỉnh Gia Lai","Huyện Chư Sê","IV"]
[null,null,null,null,null,null,null,null,null,null,null,null,null,null,null,null,null,null,null,null,null,null,null,null,"Tỉnh Gia Lai","Huyện Chư Pưh","IV"]
[null,null,null,null,null,null,null,null,null,null,null,null,null,null,null,null,null,null,null,null,null,null,null,null,"Tỉnh Gia Lai","Huyện Đức Cơ","IV"]
[null,null,null,null,null,null,null,null,null,null,null,null,null,null,null,null,null,null,null,null,null,null,null,null,"Tỉnh Gia Lai","Huyện Ia Pa","IV"]
[null,null,null,null,null,null,null,null,null,null,null,null,null,null,null,null,null,null,null,null,null,null,null,null,"Tỉnh Gia Lai","Huyện Chư Păh","IV"]
[null,null,null,null,null,null,null,null,null,null,null,null,null,null,null,null,null,null,null,null,null,null,null,null,"Tỉnh Gia Lai","Huyện Đăk Đoa","IV"]
[null,null,null,null,null,null,null,null,null,null,null,null,null,null,null,null,null,null,null,null,null,null,null,null,"Tỉnh Gia Lai","Huyện Ia Grai","IV"]
[null,null,null,null,null,null,null,null,null,null,null,null,null,null,null,null,null,null,null,null,null,null,null,null,"Tỉnh Gia Lai","Huyện Mang Yang","IV"]
[null,null,null,null,null,null,null,null,null,null,null,null,null,null,null,null,null,null,null,null,null,null,null,null,"Tỉnh Gia Lai","Huyện Kông Chro","IV"]
[null,null,null,null,null,null,null,null,null,null,null,null,null,null,null,null,null,null,null,null,null,null,null,null,"Tỉnh Gia Lai","Huyện Krông Pa","IV"]
[null,null,null,null,null,null,null,null,null,null,null,null,null,null,null,null,null,null,null,null,null,null,null,null,"Tỉnh Gia Lai","Huyện Chư Prông","IV"]
[null,null,null,null,null,null,null,null,null,null,null,null,null,null,null,null,null,null,null,null,null,null,null,null,"Tỉnh Gia Lai","Huyện KBang","IV"]
[null,null,null,null,null,null,null,null,null,null,null,null,null,null,null,null,null,null,null,null,null,null,null,null,"Tỉnh Hòa Bình","Thành phố Hoà Bình","III"]
[null,null,null,null,null,null,null,null,null,null,null,null,null,null,null,null,null,null,null,null,null,null,null,null,"Tỉnh Hòa Bình","Huyện Kỳ Sơn","IV"]
[null,null,null,null,null,null,null,null,null,null,null,null,null,null,null,null,null,null,null,null,null,null,null,null,"Tỉnh Hòa Bình","Huyện Cao Phong","IV"]
[null,null,null,null,null,null,null,null,null,null,null,null,null,null,null,null,null,null,null,null,null,null,null,null,"Tỉnh Hòa Bình","Huyện Yên Thủy","IV"]
[null,null,null,null,null,null,null,null,null,null,null,null,null,null,null,null,null,null,null,null,null,null,null,null,"Tỉnh Hòa Bình","Huyện Lạc Thủy","IV"]
[null,null,null,null,null,null,null,null,null,null,null,null,null,null,null,null,null,null,null,null,null,null,null,null,"Tỉnh Hòa Bình","Huyện Lương Sơn","III"]
[null,null,null,null,null,null,null,null,null,null,null,null,null,null,null,null,null,null,null,null,null,null,null,null,"Tỉnh Hòa Bình","Huyện Tân Lạc","IV"]
[null,null,null,null,null,null,null,null,null,null,null,null,null,null,null,null,null,null,null,null,null,null,null,null,"Tỉnh Hòa Bình","Huyện Kim Bôi","IV"]
[null,null,null,null,null,null,null,null,null,null,null,null,null,null,null,null,null,null,null,null,null,null,null,null,"Tỉnh Hòa Bình","Huyện Mai Châu","IV"]
[null,null,null,null,null,null,null,null,null,null,null,null,null,null,null,null,null,null,null,null,null,null,null,null,"Tỉnh Hòa Bình","Huyện Lạc Sơn","IV"]
[null,null,null,null,null,null,null,null,null,null,null,null,null,null,null,null,null,null,null,null,null,null,null,null,"Tỉnh Hòa Bình","Huyện Đà Bắc","IV"]
[null,null,null,null,null,null,null,null,null,null,null,null,null,null,null,null,null,null,null,null,null,null,null,null,"Tỉnh Hà Giang","Thành phố Hà Giang","III"]
[null,null,null,null,null,null,null,null,null,null,null,null,null,null,null,null,null,null,null,null,null,null,null,null,"Tỉnh Hà Giang","Huyện Đồng Văn","IV"]
[null,null,null,null,null,null,null,null,null,null,null,null,null,null,null,null,null,null,null,null,null,null,null,null,"Tỉnh Hà Giang","Huyện Quản Bạ","IV"]
[null,null,null,null,null,null,null,null,null,null,null,null,null,null,null,null,null,null,null,null,null,null,null,null,"Tỉnh Hà Giang","Huyện Mèo Vạc","IV"]
[null,null,null,null,null,null,null,null,null,null,null,null,null,null,null,null,null,null,null,null,null,null,null,null,"Tỉnh Hà Giang","Huyện Xín Mần","IV"]
[null,null,null,null,null,null,null,null,null,null,null,null,null,null,null,null,null,null,null,null,null,null,null,null,"Tỉnh Hà Giang","Huyện Hoàng Su Phì","IV"]
[null,null,null,null,null,null,null,null,null,null,null,null,null,null,null,null,null,null,null,null,null,null,null,null,"Tỉnh Hà Giang","Huyện Quang Bình","IV"]
[null,null,null,null,null,null,null,null,null,null,null,null,null,null,null,null,null,null,null,null,null,null,null,null,"Tỉnh Hà Giang","Huyện Yên Minh","IV"]
[null,null,null,null,null,null,null,null,null,null,null,null,null,null,null,null,null,null,null,null,null,null,null,null,"Tỉnh Hà Giang","Huyện Bắc Mê","IV"]
[null,null,null,null,null,null,null,null,null,null,null,null,null,null,null,null,null,null,null,null,null,null,null,null,"Tỉnh Hà Giang","Huyện Bắc Quang","IV"]
[null,null,null,null,null,null,null,null,null,null,null,null,null,null,null,null,null,null,null,null,null,null,null,null,"Tỉnh Hà Giang","Huyện Vị Xuyên","IV"]
[null,null,null,null,null,null,null,null,null,null,null,null,null,null,null,null,null,null,null,null,null,null,null,null,"Tỉnh Hà Nam","Thành phố Phủ Lý","III"]
[null,null,null,null,null,null,null,null,null,null,null,null,null,null,null,null,null,null,null,null,null,null,null,null,"Tỉnh Hà Nam","Huyện Duy Tiên","III"]
[null,null,null,null,null,null,null,null,null,null,null,null,null,null,null,null,null,null,null,null,null,null,null,null,"Tỉnh Hà Nam","Huyện Bình Lục","IV"]
[null,null,null,null,null,null,null,null,null,null,null,null,null,null,null,null,null,null,null,null,null,null,null,null,"Tỉnh Hà Nam","Huyện Thanh Liêm","IV"]
[null,null,null,null,null,null,null,null,null,null,null,null,null,null,null,null,null,null,null,null,null,null,null,null,"Tỉnh Hà Nam","Huyện Kim Bảng","III"]
[null,null,null,null,null,null,null,null,null,null,null,null,null,null,null,null,null,null,null,null,null,null,null,null,"Tỉnh Hà Nam","Huyện Lý Nhân","IV"]
[null,null,null,null,null,null,null,null,null,null,null,null,null,null,null,null,null,null,null,null,null,null,null,null,"Thành phố Hà Nội","Quận Hoàn Kiếm","I"]
[null,null,null,null,null,null,null,null,null,null,null,null,null,null,null,null,null,null,null,null,null,null,null,null,"Thành phố Hà Nội","Quận Thanh Xuân","I"]
[null,null,null,null,null,null,null,null,null,null,null,null,null,null,null,null,null,null,null,null,null,null,null,null,"Thành phố Hà Nội","Quận Ba Đình","I"]
[null,null,null,null,null,null,null,null,null,null,null,null,null,null,null,null,null,null,null,null,null,null,null,null,"Thành phố Hà Nội","Quận Hai Bà Trưng","I"]
[null,null,null,null,null,null,null,null,null,null,null,null,null,null,null,null,null,null,null,null,null,null,null,null,"Thành phố Hà Nội","Quận Đống Đa","I"]
[null,null,null,null,null,null,null,null,null,null,null,null,null,null,null,null,null,null,null,null,null,null,null,null,"Thành phố Hà Nội","Quận Cầu Giấy","I"]
[null,null,null,null,null,null,null,null,null,null,null,null,null,null,null,null,null,null,null,null,null,null,null,null,"Thành phố Hà Nội","Quận Tây Hồ","I"]
[null,null,null,null,null,null,null,null,null,null,null,null,null,null,null,null,null,null,null,null,null,null,null,null,"Thành phố Hà Nội","Quận Nam Từ Liêm","I"]
[null,null,null,null,null,null,null,null,null,null,null,null,null,null,null,null,null,null,null,null,null,null,null,null,"Thành phố Hà Nội","Quận Hoàng Mai","I"]
[null,null,null,null,null,null,null,null,null,null,null,null,null,null,null,null,null,null,null,null,null,null,null,null,"Thành phố Hà Nội","Quận Bắc Từ Liêm","I"]
[null,null,null,null,null,null,null,null,null,null,null,null,null,null,null,null,null,null,null,null,null,null,null,null,"Thành phố Hà Nội","Quận Hà Đông","I"]
[null,null,null,null,null,null,null,null,null,null,null,null,null,null,null,null,null,null,null,null,null,null,null,null,"Thành phố Hà Nội","Quận Long Biên","I"]
[null,null,null,null,null,null,null,null,null,null,null,null,null,null,null,null,null,null,null,null,null,null,null,null,"Thành phố Hà Nội","Huyện Thanh Trì","I"]
[null,null,null,null,null,null,null,null,null,null,null,null,null,null,null,null,null,null,null,null,null,null,null,null,"Thành phố Hà Nội","Huyện Đan Phượng","II"]
[null,null,null,null,null,null,null,null,null,null,null,null,null,null,null,null,null,null,null,null,null,null,null,null,"Thành phố Hà Nội","Huyện Hoài Đức","I"]
[null,null,null,null,null,null,null,null,null,null,null,null,null,null,null,null,null,null,null,null,null,null,null,null,"Thành phố Hà Nội","Thị xã Sơn Tây","I"]
[null,null,null,null,null,null,null,null,null,null,null,null,null,null,null,null,null,null,null,null,null,null,null,null,"Thành phố Hà Nội","Huyện Gia Lâm","I"]
[null,null,null,null,null,null,null,null,null,null,null,null,null,null,null,null,null,null,null,null,null,null,null,null,"Thành phố Hà Nội","Huyện Phúc Thọ","II"]
[null,null,null,null,null,null,null,null,null,null,null,null,null,null,null,null,null,null,null,null,null,null,null,null,"Thành phố Hà Nội","Huyện Thanh Oai","I"]
[null,null,null,null,null,null,null,null,null,null,null,null,null,null,null,null,null,null,null,null,null,null,null,null,"Thành phố Hà Nội","Huyện Thường Tín","I"]
[null,null,null,null,null,null,null,null,null,null,null,null,null,null,null,null,null,null,null,null,null,null,null,null,"Thành phố Hà Nội","Huyện Mê Linh","I"]
[null,null,null,null,null,null,null,null,null,null,null,null,null,null,null,null,null,null,null,null,null,null,null,null,"Thành phố Hà Nội","Huyện Quốc Oai","I"]
[null,null,null,null,null,null,null,null,null,null,null,null,null,null,null,null,null,null,null,null,null,null,null,null,"Thành phố Hà Nội","Huyện Phú Xuyên","II"]
[null,null,null,null,null,null,null,null,null,null,null,null,null,null,null,null,null,null,null,null,null,null,null,null,"Thành phố Hà Nội","Huyện Đông Anh","I"]
[null,null,null,null,null,null,null,null,null,null,null,null,null,null,null,null,null,null,null,null,null,null,null,null,"Thành phố Hà Nội","Huyện Ứng Hòa","II"]
[null,null,null,null,null,null,null,null,null,null,null,null,null,null,null,null,null,null,null,null,null,null,null,null,"Thành phố Hà Nội","Huyện Thạch Thất","I"]
[null,null,null,null,null,null,null,null,null,null,null,null,null,null,null,null,null,null,null,null,null,null,null,null,"Thành phố Hà Nội","Huyện Mỹ Đức","II"]
[null,null,null,null,null,null,null,null,null,null,null,null,null,null,null,null,null,null,null,null,null,null,null,null,"Thành phố Hà Nội","Huyện Chương Mỹ","I"]
[null,null,null,null,null,null,null,null,null,null,null,null,null,null,null,null,null,null,null,null,null,null,null,null,"Thành phố Hà Nội","Huyện Sóc Sơn","I"]
[null,null,null,null,null,null,null,null,null,null,null,null,null,null,null,null,null,null,null,null,null,null,null,null,"Thành phố Hà Nội","Huyện Ba Vì","II"]
[null,null,null,null,null,null,null,null,null,null,null,null,null,null,null,null,null,null,null,null,null,null,null,null,"Tỉnh Hà Tĩnh","Thành phố Hà Tĩnh","III"]
[null,null,null,null,null,null,null,null,null,null,null,null,null,null,null,null,null,null,null,null,null,null,null,null,"Tỉnh Hà Tĩnh","Thị xã Hồng Lĩnh","IV"]
[null,null,null,null,null,null,null,null,null,null,null,null,null,null,null,null,null,null,null,null,null,null,null,null,"Tỉnh Hà Tĩnh","Huyện Lộc Hà","IV"]
[null,null,null,null,null,null,null,null,null,null,null,null,null,null,null,null,null,null,null,null,null,null,null,null,"Tỉnh Hà Tĩnh","Huyện Đức Thọ","IV"]
[null,null,null,null,null,null,null,null,null,null,null,null,null,null,null,null,null,null,null,null,null,null,null,null,"Tỉnh Hà Tĩnh","Huyện Nghi Xuân","IV"]
[null,null,null,null,null,null,null,null,null,null,null,null,null,null,null,null,null,null,null,null,null,null,null,null,"Tỉnh Hà Tĩnh","Huyện Can Lộc","IV"]
[null,null,null,null,null,null,null,null,null,null,null,null,null,null,null,null,null,null,null,null,null,null,null,null,"Tỉnh Hà Tĩnh","Huyện Thạch Hà","IV"]
[null,null,null,null,null,null,null,null,null,null,null,null,null,null,null,null,null,null,null,null,null,null,null,null,"Tỉnh Hà Tĩnh","Huyện Cẩm Xuyên","IV"]
[null,null,null,null,null,null,null,null,null,null,null,null,null,null,null,null,null,null,null,null,null,null,null,null,"Tỉnh Hà Tĩnh","Huyện Vũ Quang","IV"]
[null,null,null,null,null,null,null,null,null,null,null,null,null,null,null,null,null,null,null,null,null,null,null,null,"Tỉnh Hà Tĩnh","Huyện Kỳ Anh","III"]
[null,null,null,null,null,null,null,null,null,null,null,null,null,null,null,null,null,null,null,null,null,null,null,null,"Tỉnh Hà Tĩnh","Huyện Hương Sơn","IV"]
[null,null,null,null,null,null,null,null,null,null,null,null,null,null,null,null,null,null,null,null,null,null,null,null,"Tỉnh Hà Tĩnh","Huyện Hương Khê","IV"]
[null,null,null,null,null,null,null,null,null,null,null,null,null,null,null,null,null,null,null,null,null,null,null,null,"Tỉnh Hưng Yên","Huyện Văn Giang","II"]
[null,null,null,null,null,null,null,null,null,null,null,null,null,null,null,null,null,null,null,null,null,null,null,null,"Tỉnh Hưng Yên","Thành phố Hưng Yên","II"]
[null,null,null,null,null,null,null,null,null,null,null,null,null,null,null,null,null,null,null,null,null,null,null,null,"Tỉnh Hưng Yên","Huyện Văn Lâm","II"]
[null,null,null,null,null,null,null,null,null,null,null,null,null,null,null,null,null,null,null,null,null,null,null,null,"Tỉnh Hưng Yên","Huyện Tiên Lữ","III"]
[null,null,null,null,null,null,null,null,null,null,null,null,null,null,null,null,null,null,null,null,null,null,null,null,"Tỉnh Hưng Yên","Huyện Mỹ Hào","II"]
[null,null,null,null,null,null,null,null,null,null,null,null,null,null,null,null,null,null,null,null,null,null,null,null,"Tỉnh Hưng Yên","Huyện Yên Mỹ","II"]
[null,null,null,null,null,null,null,null,null,null,null,null,null,null,null,null,null,null,null,null,null,null,null,null,"Tỉnh Hưng Yên","Huyện Phù Cừ","III"]
[null,null,null,null,null,null,null,null,null,null,null,null,null,null,null,null,null,null,null,null,null,null,null,null,"Tỉnh Hưng Yên","Huyện Kim Động","III"]
[null,null,null,null,null,null,null,null,null,null,null,null,null,null,null,null,null,null,null,null,null,null,null,null,"Tỉnh Hưng Yên","Huyện Ân Thi","III"]
[null,null,null,null,null,null,null,null,null,null,null,null,null,null,null,null,null,null,null,null,null,null,null,null,"Tỉnh Hưng Yên","Huyện Khoái Châu","III"]
[null,null,null,null,null,null,null,null,null,null,null,null,null,null,null,null,null,null,null,null,null,null,null,null,"Tỉnh Hải Dương","Thành phố Hải Dương","II"]
[null,null,null,null,null,null,null,null,null,null,null,null,null,null,null,null,null,null,null,null,null,null,null,null,"Tỉnh Hải Dương","Huyện Bình Giang","III"]
[null,null,null,null,null,null,null,null,null,null,null,null,null,null,null,null,null,null,null,null,null,null,null,null,"Tỉnh Hải Dương","Huyện Cẩm Giàng","III"]
[null,null,null,null,null,null,null,null,null,null,null,null,null,null,null,null,null,null,null,null,null,null,null,null,"Tỉnh Hải Dương","Huyện Nam Sách","III"]
[null,null,null,null,null,null,null,null,null,null,null,null,null,null,null,null,null,null,null,null,null,null,null,null,"Tỉnh Hải Dương","Huyện Gia Lộc","III"]
[null,null,null,null,null,null,null,null,null,null,null,null,null,null,null,null,null,null,null,null,null,null,null,null,"Tỉnh Hải Dương","Huyện Kim Thành","III"]
[null,null,null,null,null,null,null,null,null,null,null,null,null,null,null,null,null,null,null,null,null,null,null,null,"Tỉnh Hải Dương","Huyện Thanh Miện","IV"]
[null,null,null,null,null,null,null,null,null,null,null,null,null,null,null,null,null,null,null,null,null,null,null,null,"Tỉnh Hải Dương","Huyện Ninh Giang","IV"]
[null,null,null,null,null,null,null,null,null,null,null,null,null,null,null,null,null,null,null,null,null,null,null,null,"Tỉnh Hải Dương","Huyện Thanh Hà","IV"]
[null,null,null,null,null,null,null,null,null,null,null,null,null,null,null,null,null,null,null,null,null,null,null,null,"Tỉnh Hải Dương","Huyện Kinh Môn","III"]
[null,null,null,null,null,null,null,null,null,null,null,null,null,null,null,null,null,null,null,null,null,null,null,null,"Tỉnh Hải Dương","Huyện Tứ Kỳ","III"]
[null,null,null,null,null,null,null,null,null,null,null,null,null,null,null,null,null,null,null,null,null,null,null,null,"Tỉnh Hải Dương","Thị xã Chí Linh","III"]
[null,null,null,null,null,null,null,null,null,null,null,null,null,null,null,null,null,null,null,null,null,null,null,null,"Thành phố Hải Phòng","Huyện đảo Bạch Long Vĩ","II"]
[null,null,null,null,null,null,null,null,null,null,null,null,null,null,null,null,null,null,null,null,null,null,null,null,"Thành phố Hải Phòng","Quận Ngô Quyền","I"]
[null,null,null,null,null,null,null,null,null,null,null,null,null,null,null,null,null,null,null,null,null,null,null,null,"Thành phố Hải Phòng","Quận Lê Chân","I"]
[null,null,null,null,null,null,null,null,null,null,null,null,null,null,null,null,null,null,null,null,null,null,null,null,"Thành phố Hải Phòng","Quận Hồng Bàng","I"]
[null,null,null,null,null,null,null,null,null,null,null,null,null,null,null,null,null,null,null,null,null,null,null,null,"Thành phố Hải Phòng","Quận Kiến An","I"]
[null,null,null,null,null,null,null,null,null,null,null,null,null,null,null,null,null,null,null,null,null,null,null,null,"Thành phố Hải Phòng","Quận Đồ Sơn","I"]
[null,null,null,null,null,null,null,null,null,null,null,null,null,null,null,null,null,null,null,null,null,null,null,null,"Thành phố Hải Phòng","Quận Dương Kinh","I"]
[null,null,null,null,null,null,null,null,null,null,null,null,null,null,null,null,null,null,null,null,null,null,null,null,"Thành phố Hải Phòng","Huyện An Dương","I"]
[null,null,null,null,null,null,null,null,null,null,null,null,null,null,null,null,null,null,null,null,null,null,null,null,"Thành phố Hải Phòng","Quận Hải An","I"]
[null,null,null,null,null,null,null,null,null,null,null,null,null,null,null,null,null,null,null,null,null,null,null,null,"Thành phố Hải Phòng","Huyện Kiến Thụy","II"]
[null,null,null,null,null,null,null,null,null,null,null,null,null,null,null,null,null,null,null,null,null,null,null,null,"Thành phố Hải Phòng","Huyện An Lão","I"]
[null,null,null,null,null,null,null,null,null,null,null,null,null,null,null,null,null,null,null,null,null,null,null,null,"Thành phố Hải Phòng","Huyện Vĩnh Bảo","I"]
[null,null,null,null,null,null,null,null,null,null,null,null,null,null,null,null,null,null,null,null,null,null,null,null,"Thành phố Hải Phòng","Huyện Tiên Lãng","II"]
[null,null,null,null,null,null,null,null,null,null,null,null,null,null,null,null,null,null,null,null,null,null,null,null,"Thành phố Hải Phòng","Huyện Thuỷ Nguyên","I"]
[null,null,null,null,null,null,null,null,null,null,null,null,null,null,null,null,null,null,null,null,null,null,null,null,"Thành phố Hải Phòng","Huyện đảo Cát Hải","II"]
[null,null,null,null,null,null,null,null,null,null,null,null,null,null,null,null,null,null,null,null,null,null,null,null,"Tỉnh Hậu Giang","Thị xã Ngã Bảy","III"]
[null,null,null,null,null,null,null,null,null,null,null,null,null,null,null,null,null,null,null,null,null,null,null,null,"Tỉnh Hậu Giang","Thành phố Vị Thanh","III"]
[null,null,null,null,null,null,null,null,null,null,null,null,null,null,null,null,null,null,null,null,null,null,null,null,"Tỉnh Hậu Giang","Huyện Châu Thành (HG)","III"]
[null,null,null,null,null,null,null,null,null,null,null,null,null,null,null,null,null,null,null,null,null,null,null,null,"Tỉnh Hậu Giang","Huyện Châu Thành A","III"]
[null,null,null,null,null,null,null,null,null,null,null,null,null,null,null,null,null,null,null,null,null,null,null,null,"Tỉnh Hậu Giang","Huyện Vị Thủy","IV"]
[null,null,null,null,null,null,null,null,null,null,null,null,null,null,null,null,null,null,null,null,null,null,null,null,"Tỉnh Hậu Giang","Huyện Long Mỹ","IV"]
[null,null,null,null,null,null,null,null,null,null,null,null,null,null,null,null,null,null,null,null,null,null,null,null,"Tỉnh Hậu Giang","Huyện Phụng Hiệp","IV"]
[null,null,null,null,null,null,null,null,null,null,null,null,null,null,null,null,null,null,null,null,null,null,null,null,"Tỉnh Khánh Hòa","Thành phố Nha Trang","II"]
[null,null,null,null,null,null,null,null,null,null,null,null,null,null,null,null,null,null,null,null,null,null,null,null,"Tỉnh Khánh Hòa","Thành phố Cam Ranh","II"]
[null,null,null,null,null,null,null,null,null,null,null,null,null,null,null,null,null,null,null,null,null,null,null,null,"Tỉnh Khánh Hòa","Huyện Diên Khánh","III"]
[null,null,null,null,null,null,null,null,null,null,null,null,null,null,null,null,null,null,null,null,null,null,null,null,"Tỉnh Khánh Hòa","Huyện Khánh Sơn","IV"]
[null,null,null,null,null,null,null,null,null,null,null,null,null,null,null,null,null,null,null,null,null,null,null,null,"Tỉnh Khánh Hòa","Huyện đảo Trường Sa","IV"]
[null,null,null,null,null,null,null,null,null,null,null,null,null,null,null,null,null,null,null,null,null,null,null,null,"Tỉnh Khánh Hòa","Huyện Cam Lâm","III"]
[null,null,null,null,null,null,null,null,null,null,null,null,null,null,null,null,null,null,null,null,null,null,null,null,"Tỉnh Khánh Hòa","Huyện Vạn Ninh","III"]
[null,null,null,null,null,null,null,null,null,null,null,null,null,null,null,null,null,null,null,null,null,null,null,null,"Tỉnh Khánh Hòa","Huyện Khánh Vĩnh","IV"]
[null,null,null,null,null,null,null,null,null,null,null,null,null,null,null,null,null,null,null,null,null,null,null,null,"Tỉnh Khánh Hòa","Thị xã Ninh Hòa","III"]
[null,null,null,null,null,null,null,null,null,null,null,null,null,null,null,null,null,null,null,null,null,null,null,null,"Tỉnh Kiên Giang","Huyện đảo Kiên Hải","III"]
[null,null,null,null,null,null,null,null,null,null,null,null,null,null,null,null,null,null,null,null,null,null,null,null,"Tỉnh Kiên Giang","Thị xã Hà Tiên","II"]
[null,null,null,null,null,null,null,null,null,null,null,null,null,null,null,null,null,null,null,null,null,null,null,null,"Tỉnh Kiên Giang","Thành phố Rạch Giá","II"]
[null,null,null,null,null,null,null,null,null,null,null,null,null,null,null,null,null,null,null,null,null,null,null,null,"Tỉnh Kiên Giang","Huyện Châu Thành (KG)","III"]
[null,null,null,null,null,null,null,null,null,null,null,null,null,null,null,null,null,null,null,null,null,null,null,null,"Tỉnh Kiên Giang","Huyện Vĩnh Thuận","IV"]
[null,null,null,null,null,null,null,null,null,null,null,null,null,null,null,null,null,null,null,null,null,null,null,null,"Tỉnh Kiên Giang","Huyện An Biên","IV"]
[null,null,null,null,null,null,null,null,null,null,null,null,null,null,null,null,null,null,null,null,null,null,null,null,"Tỉnh Kiên Giang","Huyện Giang Thành","III"]
[null,null,null,null,null,null,null,null,null,null,null,null,null,null,null,null,null,null,null,null,null,null,null,null,"Tỉnh Kiên Giang","Huyện Tân Hiệp","IV"]
[null,null,null,null,null,null,null,null,null,null,null,null,null,null,null,null,null,null,null,null,null,null,null,null,"Tỉnh Kiên Giang","Huyện U Minh Thượng","IV"]
[null,null,null,null,null,null,null,null,null,null,null,null,null,null,null,null,null,null,null,null,null,null,null,null,"Tỉnh Kiên Giang","Huyện Gò Quao","IV"]
[null,null,null,null,null,null,null,null,null,null,null,null,null,null,null,null,null,null,null,null,null,null,null,null,"Tỉnh Kiên Giang","Huyện Kiên Lương","III"]
[null,null,null,null,null,null,null,null,null,null,null,null,null,null,null,null,null,null,null,null,null,null,null,null,"Tỉnh Kiên Giang","Huyện đảo Phú Quốc","II"]
[null,null,null,null,null,null,null,null,null,null,null,null,null,null,null,null,null,null,null,null,null,null,null,null,"Tỉnh Kiên Giang","Huyện An Minh","IV"]
[null,null,null,null,null,null,null,null,null,null,null,null,null,null,null,null,null,null,null,null,null,null,null,null,"Tỉnh Kiên Giang","Huyện Giồng Riềng","IV"]
[null,null,null,null,null,null,null,null,null,null,null,null,null,null,null,null,null,null,null,null,null,null,null,null,"Tỉnh Kiên Giang","Huyện Hòn Đất","IV"]
[null,null,null,null,null,null,null,null,null,null,null,null,null,null,null,null,null,null,null,null,null,null,null,null,"Tỉnh Kon Tum","Thành phố Kon Tum","III"]
[null,null,null,null,null,null,null,null,null,null,null,null,null,null,null,null,null,null,null,null,null,null,null,null,"Tỉnh Kon Tum","Huyện Đăk Tô","IV"]
[null,null,null,null,null,null,null,null,null,null,null,null,null,null,null,null,null,null,null,null,null,null,null,null,"Tỉnh Kon Tum","Huyện Ngọc Hồi","IV"]
[null,null,null,null,null,null,null,null,null,null,null,null,null,null,null,null,null,null,null,null,null,null,null,null,"Tỉnh Kon Tum","Huyện Đắk Hà","III"]
[null,null,null,null,null,null,null,null,null,null,null,null,null,null,null,null,null,null,null,null,null,null,null,null,"Tỉnh Kon Tum","Huyện Tu Mơ Rông","IV"]
[null,null,null,null,null,null,null,null,null,null,null,null,null,null,null,null,null,null,null,null,null,null,null,null,"Tỉnh Kon Tum","Huyện Kon Rẫy","IV"]
[null,null,null,null,null,null,null,null,null,null,null,null,null,null,null,null,null,null,null,null,null,null,null,null,"Tỉnh Kon Tum","Huyện Kon Plông","IV"]
[null,null,null,null,null,null,null,null,null,null,null,null,null,null,null,null,null,null,null,null,null,null,null,null,"Tỉnh Kon Tum","Huyện Đắk Glei","IV"]
[null,null,null,null,null,null,null,null,null,null,null,null,null,null,null,null,null,null,null,null,null,null,null,null,"Tỉnh Kon Tum","Huyện Sa Thầy","IV"]
[null,null,null,null,null,null,null,null,null,null,null,null,null,null,null,null,null,null,null,null,null,null,null,null,"Tỉnh Lai Châu","Thành phố Lai Châu","III"]
[null,null,null,null,null,null,null,null,null,null,null,null,null,null,null,null,null,null,null,null,null,null,null,null,"Tỉnh Lai Châu","Huyện Tam Đường","IV"]
[null,null,null,null,null,null,null,null,null,null,null,null,null,null,null,null,null,null,null,null,null,null,null,null,"Tỉnh Lai Châu","Huyện Than Uyên","IV"]
[null,null,null,null,null,null,null,null,null,null,null,null,null,null,null,null,null,null,null,null,null,null,null,null,"Tỉnh Lai Châu","Huyện Tân Uyên","IV"]
[null,null,null,null,null,null,null,null,null,null,null,null,null,null,null,null,null,null,null,null,null,null,null,null,"Tỉnh Lai Châu","Huyện Phong Thổ","IV"]
[null,null,null,null,null,null,null,null,null,null,null,null,null,null,null,null,null,null,null,null,null,null,null,null,"Tỉnh Lai Châu","Huyện Nậm Nhùn","IV"]
[null,null,null,null,null,null,null,null,null,null,null,null,null,null,null,null,null,null,null,null,null,null,null,null,"Tỉnh Lai Châu","Huyện Sìn Hồ","IV"]
[null,null,null,null,null,null,null,null,null,null,null,null,null,null,null,null,null,null,null,null,null,null,null,null,"Tỉnh Lai Châu","Huyện Mường Tè","IV"]
[null,null,null,null,null,null,null,null,null,null,null,null,null,null,null,null,null,null,null,null,null,null,null,null,"Tỉnh Long An","Thành phố Tân An","II"]
[null,null,null,null,null,null,null,null,null,null,null,null,null,null,null,null,null,null,null,null,null,null,null,null,"Tỉnh Long An","Huyện Tân Trụ","III"]
[null,null,null,null,null,null,null,null,null,null,null,null,null,null,null,null,null,null,null,null,null,null,null,null,"Tỉnh Long An","Huyện Châu Thành (LA)","III"]
[null,null,null,null,null,null,null,null,null,null,null,null,null,null,null,null,null,null,null,null,null,null,null,null,"Tỉnh Long An","Thị xã Kiến Tường","III"]
[null,null,null,null,null,null,null,null,null,null,null,null,null,null,null,null,null,null,null,null,null,null,null,null,"Tỉnh Long An","Huyện Cần Giuộc","II"]
[null,null,null,null,null,null,null,null,null,null,null,null,null,null,null,null,null,null,null,null,null,null,null,null,"Tỉnh Long An","Huyện Cần Đước","II"]
[null,null,null,null,null,null,null,null,null,null,null,null,null,null,null,null,null,null,null,null,null,null,null,null,"Tỉnh Long An","Huyện Bến Lức","II"]
[null,null,null,null,null,null,null,null,null,null,null,null,null,null,null,null,null,null,null,null,null,null,null,null,"Tỉnh Long An","Huyện Mộc Hóa","IV"]
[null,null,null,null,null,null,null,null,null,null,null,null,null,null,null,null,null,null,null,null,null,null,null,null,"Tỉnh Long An","Huyện Thủ Thừa","III"]
[null,null,null,null,null,null,null,null,null,null,null,null,null,null,null,null,null,null,null,null,null,null,null,null,"Tỉnh Long An","Huyện Vĩnh Hưng","IV"]
[null,null,null,null,null,null,null,null,null,null,null,null,null,null,null,null,null,null,null,null,null,null,null,null,"Tỉnh Long An","Huyện Tân Thạnh","IV"]
[null,null,null,null,null,null,null,null,null,null,null,null,null,null,null,null,null,null,null,null,null,null,null,null,"Tỉnh Long An","Huyện Đức Hòa","II"]
[null,null,null,null,null,null,null,null,null,null,null,null,null,null,null,null,null,null,null,null,null,null,null,null,"Tỉnh Long An","Huyện Đức Huệ","III"]
[null,null,null,null,null,null,null,null,null,null,null,null,null,null,null,null,null,null,null,null,null,null,null,null,"Tỉnh Long An","Huyện Thạnh Hóa","III"]
[null,null,null,null,null,null,null,null,null,null,null,null,null,null,null,null,null,null,null,null,null,null,null,null,"Tỉnh Long An","Huyện Tân Hưng","IV"]
[null,null,null,null,null,null,null,null,null,null,null,null,null,null,null,null,null,null,null,null,null,null,null,null,"Tỉnh Lào Cai","Thành phố Lào Cai","II"]
[null,null,null,null,null,null,null,null,null,null,null,null,null,null,null,null,null,null,null,null,null,null,null,null,"Tỉnh Lào Cai","Huyện Si Ma Cai","IV"]
[null,null,null,null,null,null,null,null,null,null,null,null,null,null,null,null,null,null,null,null,null,null,null,null,"Tỉnh Lào Cai","Huyện Mường Khương","IV"]
[null,null,null,null,null,null,null,null,null,null,null,null,null,null,null,null,null,null,null,null,null,null,null,null,"Tỉnh Lào Cai","Huyện Bắc Hà","IV"]
[null,null,null,null,null,null,null,null,null,null,null,null,null,null,null,null,null,null,null,null,null,null,null,null,"Tỉnh Lào Cai","Huyện Bảo Thắng","III"]
[null,null,null,null,null,null,null,null,null,null,null,null,null,null,null,null,null,null,null,null,null,null,null,null,"Tỉnh Lào Cai","Huyện Sa Pa","III"]
[null,null,null,null,null,null,null,null,null,null,null,null,null,null,null,null,null,null,null,null,null,null,null,null,"Tỉnh Lào Cai","Huyện Bảo Yên","IV"]
[null,null,null,null,null,null,null,null,null,null,null,null,null,null,null,null,null,null,null,null,null,null,null,null,"Tỉnh Lào Cai","Huyện Bát Xát","IV"]
[null,null,null,null,null,null,null,null,null,null,null,null,null,null,null,null,null,null,null,null,null,null,null,null,"Tỉnh Lào Cai","Huyện Văn Bàn","IV"]
[null,null,null,null,null,null,null,null,null,null,null,null,null,null,null,null,null,null,null,null,null,null,null,null,"Tỉnh Lâm Đồng","Thành phố Bảo Lộc","II"]
[null,null,null,null,null,null,null,null,null,null,null,null,null,null,null,null,null,null,null,null,null,null,null,null,"Tỉnh Lâm Đồng","Thành phố Đà Lạt","II"]
[null,null,null,null,null,null,null,null,null,null,null,null,null,null,null,null,null,null,null,null,null,null,null,null,"Tỉnh Lâm Đồng","Huyện Cát Tiên","IV"]
[null,null,null,null,null,null,null,null,null,null,null,null,null,null,null,null,null,null,null,null,null,null,null,null,"Tỉnh Lâm Đồng","Huyện Đạ Huoai","IV"]
[null,null,null,null,null,null,null,null,null,null,null,null,null,null,null,null,null,null,null,null,null,null,null,null,"Tỉnh Lâm Đồng","Huyện Đạ Tẻh","IV"]
[null,null,null,null,null,null,null,null,null,null,null,null,null,null,null,null,null,null,null,null,null,null,null,null,"Tỉnh Lâm Đồng","Huyện Đơn Dương","IV"]
[null,null,null,null,null,null,null,null,null,null,null,null,null,null,null,null,null,null,null,null,null,null,null,null,"Tỉnh Lâm Đồng","Huyện Đam Rông","IV"]
[null,null,null,null,null,null,null,null,null,null,null,null,null,null,null,null,null,null,null,null,null,null,null,null,"Tỉnh Lâm Đồng","Huyện Đức Trọng","III"]
[null,null,null,null,null,null,null,null,null,null,null,null,null,null,null,null,null,null,null,null,null,null,null,null,"Tỉnh Lâm Đồng","Huyện Lâm Hà","IV"]
[null,null,null,null,null,null,null,null,null,null,null,null,null,null,null,null,null,null,null,null,null,null,null,null,"Tỉnh Lâm Đồng","Huyện Lạc Dương","IV"]
[null,null,null,null,null,null,null,null,null,null,null,null,null,null,null,null,null,null,null,null,null,null,null,null,"Tỉnh Lâm Đồng","Huyện Bảo Lâm ","IV"]
[null,null,null,null,null,null,null,null,null,null,null,null,null,null,null,null,null,null,null,null,null,null,null,null,"Tỉnh Lâm Đồng","Huyện Di Linh","III"]
[null,null,null,null,null,null,null,null,null,null,null,null,null,null,null,null,null,null,null,null,null,null,null,null,"Tỉnh Lạng Sơn","Thành phố Lạng Sơn","III"]
[null,null,null,null,null,null,null,null,null,null,null,null,null,null,null,null,null,null,null,null,null,null,null,null,"Tỉnh Lạng Sơn","Huyện Văn Quan","IV"]
[null,null,null,null,null,null,null,null,null,null,null,null,null,null,null,null,null,null,null,null,null,null,null,null,"Tỉnh Lạng Sơn","Huyện Vãn Lãng","IV"]
[null,null,null,null,null,null,null,null,null,null,null,null,null,null,null,null,null,null,null,null,null,null,null,null,"Tỉnh Lạng Sơn","Huyện Cao Lộc","IV"]
[null,null,null,null,null,null,null,null,null,null,null,null,null,null,null,null,null,null,null,null,null,null,null,null,"Tỉnh Lạng Sơn","Huyện Bắc Sơn","IV"]
[null,null,null,null,null,null,null,null,null,null,null,null,null,null,null,null,null,null,null,null,null,null,null,null,"Tỉnh Lạng Sơn","Huyện Chi Lăng","IV"]
[null,null,null,null,null,null,null,null,null,null,null,null,null,null,null,null,null,null,null,null,null,null,null,null,"Tỉnh Lạng Sơn","Huyện Hữu Lũng","IV"]
[null,null,null,null,null,null,null,null,null,null,null,null,null,null,null,null,null,null,null,null,null,null,null,null,"Tỉnh Lạng Sơn","Huyện Tràng Định","IV"]
[null,null,null,null,null,null,null,null,null,null,null,null,null,null,null,null,null,null,null,null,null,null,null,null,"Tỉnh Lạng Sơn","Huyện Lộc Bình","IV"]
[null,null,null,null,null,null,null,null,null,null,null,null,null,null,null,null,null,null,null,null,null,null,null,null,"Tỉnh Lạng Sơn","Huyện Bình Gia","IV"]
[null,null,null,null,null,null,null,null,null,null,null,null,null,null,null,null,null,null,null,null,null,null,null,null,"Tỉnh Lạng Sơn","Huyện Đình Lập","IV"]
[null,null,null,null,null,null,null,null,null,null,null,null,null,null,null,null,null,null,null,null,null,null,null,null,"Tỉnh Nam Định","Thành phố Nam Định","II"]
[null,null,null,null,null,null,null,null,null,null,null,null,null,null,null,null,null,null,null,null,null,null,null,null,"Tỉnh Nam Định","Huyện Mỹ Lộc","II"]
[null,null,null,null,null,null,null,null,null,null,null,null,null,null,null,null,null,null,null,null,null,null,null,null,"Tỉnh Nam Định","Huyện Xuân Trường","III"]
[null,null,null,null,null,null,null,null,null,null,null,null,null,null,null,null,null,null,null,null,null,null,null,null,"Tỉnh Nam Định","Huyện Trực Ninh","III"]
[null,null,null,null,null,null,null,null,null,null,null,null,null,null,null,null,null,null,null,null,null,null,null,null,"Tỉnh Nam Định","Huyện Vụ Bản","III"]
[null,null,null,null,null,null,null,null,null,null,null,null,null,null,null,null,null,null,null,null,null,null,null,null,"Tỉnh Nam Định","Huyện Nam Trực","III"]
[null,null,null,null,null,null,null,null,null,null,null,null,null,null,null,null,null,null,null,null,null,null,null,null,"Tỉnh Nam Định","Huyện Hải Hậu","III"]
[null,null,null,null,null,null,null,null,null,null,null,null,null,null,null,null,null,null,null,null,null,null,null,null,"Tỉnh Nam Định","Huyện Giao Thủy","III"]
[null,null,null,null,null,null,null,null,null,null,null,null,null,null,null,null,null,null,null,null,null,null,null,null,"Tỉnh Nam Định","Huyện Ý Yên","III"]
[null,null,null,null,null,null,null,null,null,null,null,null,null,null,null,null,null,null,null,null,null,null,null,null,"Tỉnh Nam Định","Huyện Nghĩa Hưng","III"]
[null,null,null,null,null,null,null,null,null,null,null,null,null,null,null,null,null,null,null,null,null,null,null,null,"Tỉnh Nghệ An","Thị xã Cửa Lò","IV"]
[null,null,null,null,null,null,null,null,null,null,null,null,null,null,null,null,null,null,null,null,null,null,null,null,"Tỉnh Nghệ An","Thành phố Vinh","III"]
[null,null,null,null,null,null,null,null,null,null,null,null,null,null,null,null,null,null,null,null,null,null,null,null,"Tỉnh Nghệ An","Thị xã Thái Hòa","IV"]
[null,null,null,null,null,null,null,null,null,null,null,null,null,null,null,null,null,null,null,null,null,null,null,null,"Tỉnh Nghệ An","Huyện Hưng Nguyên","IV"]
[null,null,null,null,null,null,null,null,null,null,null,null,null,null,null,null,null,null,null,null,null,null,null,null,"Tỉnh Nghệ An","Thị xã Hoàng Mai","IV"]
[null,null,null,null,null,null,null,null,null,null,null,null,null,null,null,null,null,null,null,null,null,null,null,null,"Tỉnh Nghệ An","Huyện Nam Đàn","IV"]
[null,null,null,null,null,null,null,null,null,null,null,null,null,null,null,null,null,null,null,null,null,null,null,null,"Tỉnh Nghệ An","Huyện Diễn Châu","IV"]
[null,null,null,null,null,null,null,null,null,null,null,null,null,null,null,null,null,null,null,null,null,null,null,null,"Tỉnh Nghệ An","Huyện Nghi Lộc","IV"]
[null,null,null,null,null,null,null,null,null,null,null,null,null,null,null,null,null,null,null,null,null,null,null,null,"Tỉnh Nghệ An","Huyện Đô Lương","IV"]
[null,null,null,null,null,null,null,null,null,null,null,null,null,null,null,null,null,null,null,null,null,null,null,null,"Tỉnh Nghệ An","Huyện Quỳnh Lưu","IV"]
[null,null,null,null,null,null,null,null,null,null,null,null,null,null,null,null,null,null,null,null,null,null,null,null,"Tỉnh Nghệ An","Huyện Yên Thành","IV"]
[null,null,null,null,null,null,null,null,null,null,null,null,null,null,null,null,null,null,null,null,null,null,null,null,"Tỉnh Nghệ An","Huyện Anh Sơn","IV"]
[null,null,null,null,null,null,null,null,null,null,null,null,null,null,null,null,null,null,null,null,null,null,null,null,"Tỉnh Nghệ An","Huyện Nghĩa Đàn","IV"]
[null,null,null,null,null,null,null,null,null,null,null,null,null,null,null,null,null,null,null,null,null,null,null,null,"Tỉnh Nghệ An","Huyện Tân Kỳ","IV"]
[null,null,null,null,null,null,null,null,null,null,null,null,null,null,null,null,null,null,null,null,null,null,null,null,"Tỉnh Nghệ An","Huyện Quỳ Hợp","IV"]
[null,null,null,null,null,null,null,null,null,null,null,null,null,null,null,null,null,null,null,null,null,null,null,null,"Tỉnh Nghệ An","Huyện Quỳ Châu","IV"]
[null,null,null,null,null,null,null,null,null,null,null,null,null,null,null,null,null,null,null,null,null,null,null,null,"Tỉnh Nghệ An","Huyện Thanh Chương","IV"]
[null,null,null,null,null,null,null,null,null,null,null,null,null,null,null,null,null,null,null,null,null,null,null,null,"Tỉnh Nghệ An","Huyện Con Cuông","IV"]
[null,null,null,null,null,null,null,null,null,null,null,null,null,null,null,null,null,null,null,null,null,null,null,null,"Tỉnh Nghệ An","Huyện Quế Phong","IV"]
[null,null,null,null,null,null,null,null,null,null,null,null,null,null,null,null,null,null,null,null,null,null,null,null,"Tỉnh Nghệ An","Huyện Kỳ Sơn ","IV"]
[null,null,null,null,null,null,null,null,null,null,null,null,null,null,null,null,null,null,null,null,null,null,null,null,"Tỉnh Nghệ An","Huyện Tương Dương","IV"]
[null,null,null,null,null,null,null,null,null,null,null,null,null,null,null,null,null,null,null,null,null,null,null,null,"Tỉnh Ninh Bình","Thành phố Ninh Bình","II"]
[null,null,null,null,null,null,null,null,null,null,null,null,null,null,null,null,null,null,null,null,null,null,null,null,"Tỉnh Ninh Bình","Huyện Hoa Lư","III"]
[null,null,null,null,null,null,null,null,null,null,null,null,null,null,null,null,null,null,null,null,null,null,null,null,"Tỉnh Ninh Bình","Thị xã Tam Điệp","III"]
[null,null,null,null,null,null,null,null,null,null,null,null,null,null,null,null,null,null,null,null,null,null,null,null,"Tỉnh Ninh Bình","Huyện Yên Khánh","III"]
[null,null,null,null,null,null,null,null,null,null,null,null,null,null,null,null,null,null,null,null,null,null,null,null,"Tỉnh Ninh Bình","Huyện Yên Mô","IV"]
[null,null,null,null,null,null,null,null,null,null,null,null,null,null,null,null,null,null,null,null,null,null,null,null,"Tỉnh Ninh Bình","Huyện Kim Sơn","IV"]
[null,null,null,null,null,null,null,null,null,null,null,null,null,null,null,null,null,null,null,null,null,null,null,null,"Tỉnh Ninh Bình","Huyện Gia Viễn","III"]
[null,null,null,null,null,null,null,null,null,null,null,null,null,null,null,null,null,null,null,null,null,null,null,null,"Tỉnh Ninh Bình","Huyện Nho Quan","IV"]
[null,null,null,null,null,null,null,null,null,null,null,null,null,null,null,null,null,null,null,null,null,null,null,null,"Tỉnh Ninh Thuận","Thành phố Phan Rang-Tháp Chàm","III"]
[null,null,null,null,null,null,null,null,null,null,null,null,null,null,null,null,null,null,null,null,null,null,null,null,"Tỉnh Ninh Thuận","Huyện Ninh Hải","III"]
[null,null,null,null,null,null,null,null,null,null,null,null,null,null,null,null,null,null,null,null,null,null,null,null,"Tỉnh Ninh Thuận","Huyện Thuận Bắc","III"]
[null,null,null,null,null,null,null,null,null,null,null,null,null,null,null,null,null,null,null,null,null,null,null,null,"Tỉnh Ninh Thuận","Huyện Ninh Phước","IV"]
[null,null,null,null,null,null,null,null,null,null,null,null,null,null,null,null,null,null,null,null,null,null,null,null,"Tỉnh Ninh Thuận","Huyện Thuận Nam","IV"]
[null,null,null,null,null,null,null,null,null,null,null,null,null,null,null,null,null,null,null,null,null,null,null,null,"Tỉnh Ninh Thuận","Huyện Ninh Sơn","IV"]
[null,null,null,null,null,null,null,null,null,null,null,null,null,null,null,null,null,null,null,null,null,null,null,null,"Tỉnh Ninh Thuận","Huyện Bác Ái","IV"]
[null,null,null,null,null,null,null,null,null,null,null,null,null,null,null,null,null,null,null,null,null,null,null,null,"Tỉnh Phú Thọ","Thị xã Phú Thọ","III"]
[null,null,null,null,null,null,null,null,null,null,null,null,null,null,null,null,null,null,null,null,null,null,null,null,"Tỉnh Phú Thọ","Huyện Lâm Thao","III"]
[null,null,null,null,null,null,null,null,null,null,null,null,null,null,null,null,null,null,null,null,null,null,null,null,"Tỉnh Phú Thọ","Thành phố Việt Trì","II"]
[null,null,null,null,null,null,null,null,null,null,null,null,null,null,null,null,null,null,null,null,null,null,null,null,"Tỉnh Phú Thọ","Huyện Thanh Thủy","IV"]
[null,null,null,null,null,null,null,null,null,null,null,null,null,null,null,null,null,null,null,null,null,null,null,null,"Tỉnh Phú Thọ","Huyện Tam Nông","III"]
[null,null,null,null,null,null,null,null,null,null,null,null,null,null,null,null,null,null,null,null,null,null,null,null,"Tỉnh Phú Thọ","Huyện Phù Ninh","III"]
[null,null,null,null,null,null,null,null,null,null,null,null,null,null,null,null,null,null,null,null,null,null,null,null,"Tỉnh Phú Thọ","Huyện Thanh Ba","III"]
[null,null,null,null,null,null,null,null,null,null,null,null,null,null,null,null,null,null,null,null,null,null,null,null,"Tỉnh Phú Thọ","Huyện Cẩm Khê","IV"]
[null,null,null,null,null,null,null,null,null,null,null,null,null,null,null,null,null,null,null,null,null,null,null,null,"Tỉnh Phú Thọ","Huyện Đoan Hùng","IV"]
[null,null,null,null,null,null,null,null,null,null,null,null,null,null,null,null,null,null,null,null,null,null,null,null,"Tỉnh Phú Thọ","Huyện Hạ Hòa","IV"]
[null,null,null,null,null,null,null,null,null,null,null,null,null,null,null,null,null,null,null,null,null,null,null,null,"Tỉnh Phú Thọ","Huyện Yên Lập","IV"]
[null,null,null,null,null,null,null,null,null,null,null,null,null,null,null,null,null,null,null,null,null,null,null,null,"Tỉnh Phú Thọ","Huyện Thanh Sơn","IV"]
[null,null,null,null,null,null,null,null,null,null,null,null,null,null,null,null,null,null,null,null,null,null,null,null,"Tỉnh Phú Thọ","Huyện Tân Sơn","IV"]
[null,null,null,null,null,null,null,null,null,null,null,null,null,null,null,null,null,null,null,null,null,null,null,null,"Tỉnh Phú Yên","Thành phố Tuy Hòa","III"]
[null,null,null,null,null,null,null,null,null,null,null,null,null,null,null,null,null,null,null,null,null,null,null,null,"Tỉnh Phú Yên","Huyện Phú Hòa","IV"]
[null,null,null,null,null,null,null,null,null,null,null,null,null,null,null,null,null,null,null,null,null,null,null,null,"Tỉnh Phú Yên","Huyện Đông Hòa","III"]
[null,null,null,null,null,null,null,null,null,null,null,null,null,null,null,null,null,null,null,null,null,null,null,null,"Tỉnh Phú Yên","Huyện Tuy An","IV"]
[null,null,null,null,null,null,null,null,null,null,null,null,null,null,null,null,null,null,null,null,null,null,null,null,"Tỉnh Phú Yên","Thị xã Sông Cầu","III"]
[null,null,null,null,null,null,null,null,null,null,null,null,null,null,null,null,null,null,null,null,null,null,null,null,"Tỉnh Phú Yên","Huyện Tây Hòa","IV"]
[null,null,null,null,null,null,null,null,null,null,null,null,null,null,null,null,null,null,null,null,null,null,null,null,"Tỉnh Phú Yên","Huyện Sông Hinh","IV"]
[null,null,null,null,null,null,null,null,null,null,null,null,null,null,null,null,null,null,null,null,null,null,null,null,"Tỉnh Phú Yên","Huyện Sơn Hòa","IV"]
[null,null,null,null,null,null,null,null,null,null,null,null,null,null,null,null,null,null,null,null,null,null,null,null,"Tỉnh Phú Yên","Huyện Đồng Xuân","IV"]
[null,null,null,null,null,null,null,null,null,null,null,null,null,null,null,null,null,null,null,null,null,null,null,null,"Tỉnh Quảng Bình","Thành phố Đồng Hới","III"]
[null,null,null,null,null,null,null,null,null,null,null,null,null,null,null,null,null,null,null,null,null,null,null,null,"Tỉnh Quảng Bình","Thị xã Ba Đồn","IV"]
[null,null,null,null,null,null,null,null,null,null,null,null,null,null,null,null,null,null,null,null,null,null,null,null,"Tỉnh Quảng Bình","Huyện Quảng Trạch","IV"]
[null,null,null,null,null,null,null,null,null,null,null,null,null,null,null,null,null,null,null,null,null,null,null,null,"Tỉnh Quảng Bình","Huyện Tuyên Hóa","IV"]
[null,null,null,null,null,null,null,null,null,null,null,null,null,null,null,null,null,null,null,null,null,null,null,null,"Tỉnh Quảng Bình","Huyện Quảng Ninh","IV"]
[null,null,null,null,null,null,null,null,null,null,null,null,null,null,null,null,null,null,null,null,null,null,null,null,"Tỉnh Quảng Bình","Huyện Minh Hóa","IV"]
[null,null,null,null,null,null,null,null,null,null,null,null,null,null,null,null,null,null,null,null,null,null,null,null,"Tỉnh Quảng Bình","Huyện Lệ Thủy","IV"]
[null,null,null,null,null,null,null,null,null,null,null,null,null,null,null,null,null,null,null,null,null,null,null,null,"Tỉnh Quảng Bình","Huyện Bố Trạch","IV"]
[null,null,null,null,null,null,null,null,null,null,null,null,null,null,null,null,null,null,null,null,null,null,null,null,"Tỉnh Quảng Nam","Thành phố Hội An","III"]
[null,null,null,null,null,null,null,null,null,null,null,null,null,null,null,null,null,null,null,null,null,null,null,null,"Tỉnh Quảng Nam","Thành phố Tam Kỳ","III"]
[null,null,null,null,null,null,null,null,null,null,null,null,null,null,null,null,null,null,null,null,null,null,null,null,"Tỉnh Quảng Nam","Thị xã Điện Bàn","III","theo 122"]
[null,null,null,null,null,null,null,null,null,null,null,null,null,null,null,null,null,null,null,null,null,null,null,null,"Tỉnh Quảng Nam","Huyện Quế Sơn","IV"]
[null,null,null,null,null,null,null,null,null,null,null,null,null,null,null,null,null,null,null,null,null,null,null,null,"Tỉnh Quảng Nam","Huyện Phú Ninh","IV"]
[null,null,null,null,null,null,null,null,null,null,null,null,null,null,null,null,null,null,null,null,null,null,null,null,"Tỉnh Quảng Nam","Huyện Duy Xuyên","III"]
[null,null,null,null,null,null,null,null,null,null,null,null,null,null,null,null,null,null,null,null,null,null,null,null,"Tỉnh Quảng Nam","Huyện Thăng Bình","IV"]
[null,null,null,null,null,null,null,null,null,null,null,null,null,null,null,null,null,null,null,null,null,null,null,null,"Tỉnh Quảng Nam","Huyện Tiên Phước","IV"]
[null,null,null,null,null,null,null,null,null,null,null,null,null,null,null,null,null,null,null,null,null,null,null,null,"Tỉnh Quảng Nam","Huyện Nông Sơn","IV"]
[null,null,null,null,null,null,null,null,null,null,null,null,null,null,null,null,null,null,null,null,null,null,null,null,"Tỉnh Quảng Nam","Huyện Hiệp Đức","IV"]
[null,null,null,null,null,null,null,null,null,null,null,null,null,null,null,null,null,null,null,null,null,null,null,null,"Tỉnh Quảng Nam","Huyện Núi Thành","III"]
[null,null,null,null,null,null,null,null,null,null,null,null,null,null,null,null,null,null,null,null,null,null,null,null,"Tỉnh Quảng Nam","Huyện Đại Lộc","III"]
[null,null,null,null,null,null,null,null,null,null,null,null,null,null,null,null,null,null,null,null,null,null,null,null,"Tỉnh Quảng Nam","Huyện Đông Giang","IV"]
[null,null,null,null,null,null,null,null,null,null,null,null,null,null,null,null,null,null,null,null,null,null,null,null,"Tỉnh Quảng Nam","Huyện Bắc Trà My","IV"]
[null,null,null,null,null,null,null,null,null,null,null,null,null,null,null,null,null,null,null,null,null,null,null,null,"Tỉnh Quảng Nam","Huyện Nam Trà My","IV"]
[null,null,null,null,null,null,null,null,null,null,null,null,null,null,null,null,null,null,null,null,null,null,null,null,"Tỉnh Quảng Nam","Huyện Tây Giang","IV"]
[null,null,null,null,null,null,null,null,null,null,null,null,null,null,null,null,null,null,null,null,null,null,null,null,"Tỉnh Quảng Nam","Huyện Phước Sơn","IV"]
[null,null,null,null,null,null,null,null,null,null,null,null,null,null,null,null,null,null,null,null,null,null,null,null,"Tỉnh Quảng Nam","Huyện Nam Giang","IV"]
[null,null,null,null,null,null,null,null,null,null,null,null,null,null,null,null,null,null,null,null,null,null,null,null,"Tỉnh Quảng Ngãi","Huyện đảo Lý Sơn","IV"]
[null,null,null,null,null,null,null,null,null,null,null,null,null,null,null,null,null,null,null,null,null,null,null,null,"Tỉnh Quảng Ngãi","Thành phố Quảng Ngãi","III"]
[null,null,null,null,null,null,null,null,null,null,null,null,null,null,null,null,null,null,null,null,null,null,null,null,"Tỉnh Quảng Ngãi","Huyện Tư Nghĩa","IV"]
[null,null,null,null,null,null,null,null,null,null,null,null,null,null,null,null,null,null,null,null,null,null,null,null,"Tỉnh Quảng Ngãi","Huyện Mộ Đức","IV"]
[null,null,null,null,null,null,null,null,null,null,null,null,null,null,null,null,null,null,null,null,null,null,null,null,"Tỉnh Quảng Ngãi","Huyện Minh Long","IV"]
[null,null,null,null,null,null,null,null,null,null,null,null,null,null,null,null,null,null,null,null,null,null,null,null,"Tỉnh Quảng Ngãi","Huyện Nghĩa Hành","IV"]
[null,null,null,null,null,null,null,null,null,null,null,null,null,null,null,null,null,null,null,null,null,null,null,null,"Tỉnh Quảng Ngãi","Huyện Sơn Tịnh","III"]
[null,null,null,null,null,null,null,null,null,null,null,null,null,null,null,null,null,null,null,null,null,null,null,null,"Tỉnh Quảng Ngãi","Huyện Tây Trà","IV"]
[null,null,null,null,null,null,null,null,null,null,null,null,null,null,null,null,null,null,null,null,null,null,null,null,"Tỉnh Quảng Ngãi","Huyện Đức Phổ","IV"]
[null,null,null,null,null,null,null,null,null,null,null,null,null,null,null,null,null,null,null,null,null,null,null,null,"Tỉnh Quảng Ngãi","Huyện Sơn Tây","IV"]
[null,null,null,null,null,null,null,null,null,null,null,null,null,null,null,null,null,null,null,null,null,null,null,null,"Tỉnh Quảng Ngãi","Huyện Trà Bồng","IV"]
[null,null,null,null,null,null,null,null,null,null,null,null,null,null,null,null,null,null,null,null,null,null,null,null,"Tỉnh Quảng Ngãi","Huyện Bình Sơn","III"]
[null,null,null,null,null,null,null,null,null,null,null,null,null,null,null,null,null,null,null,null,null,null,null,null,"Tỉnh Quảng Ngãi","Huyện Sơn Hà","IV"]
[null,null,null,null,null,null,null,null,null,null,null,null,null,null,null,null,null,null,null,null,null,null,null,null,"Tỉnh Quảng Ngãi","Huyện Ba Tơ","IV"]
[null,null,null,null,null,null,null,null,null,null,null,null,null,null,null,null,null,null,null,null,null,null,null,null,"Tỉnh Quảng Ninh","Huyện đảo Cô Tô","IV"]
[null,null,null,null,null,null,null,null,null,null,null,null,null,null,null,null,null,null,null,null,null,null,null,null,"Tỉnh Quảng Ninh","Thành phố Uông Bí","II"]
[null,null,null,null,null,null,null,null,null,null,null,null,null,null,null,null,null,null,null,null,null,null,null,null,"Tỉnh Quảng Ninh","Thành phố Hạ Long","II"]
[null,null,null,null,null,null,null,null,null,null,null,null,null,null,null,null,null,null,null,null,null,null,null,null,"Tỉnh Quảng Ninh","Thị xã Quảng Yên","III","theo 122"]
[null,null,null,null,null,null,null,null,null,null,null,null,null,null,null,null,null,null,null,null,null,null,null,null,"Tỉnh Quảng Ninh","Huyện Đông Triều","III"]
[null,null,null,null,null,null,null,null,null,null,null,null,null,null,null,null,null,null,null,null,null,null,null,null,"Tỉnh Quảng Ninh","Huyện Đầm Hà","IV"]
[null,null,null,null,null,null,null,null,null,null,null,null,null,null,null,null,null,null,null,null,null,null,null,null,"Tỉnh Quảng Ninh","Huyện Tiên Yên","IV"]
[null,null,null,null,null,null,null,null,null,null,null,null,null,null,null,null,null,null,null,null,null,null,null,null,"Tỉnh Quảng Ninh","Huyện Bình Liêu","IV"]
[null,null,null,null,null,null,null,null,null,null,null,null,null,null,null,null,null,null,null,null,null,null,null,null,"Tỉnh Quảng Ninh","Thành phố Cẩm Phả","II"]
[null,null,null,null,null,null,null,null,null,null,null,null,null,null,null,null,null,null,null,null,null,null,null,null,"Tỉnh Quảng Ninh","Thành phố Móng Cái","II"]
[null,null,null,null,null,null,null,null,null,null,null,null,null,null,null,null,null,null,null,null,null,null,null,null,"Tỉnh Quảng Ninh","Huyện Hải Hà","IV"]
[null,null,null,null,null,null,null,null,null,null,null,null,null,null,null,null,null,null,null,null,null,null,null,null,"Tỉnh Quảng Ninh","Huyện đảo Vân Đồn","IV"]
[null,null,null,null,null,null,null,null,null,null,null,null,null,null,null,null,null,null,null,null,null,null,null,null,"Tỉnh Quảng Ninh","Huyện Ba Chẽ","IV"]
[null,null,null,null,null,null,null,null,null,null,null,null,null,null,null,null,null,null,null,null,null,null,null,null,"Tỉnh Quảng Ninh","Huyện Hoành Bồ","III"]
[null,null,null,null,null,null,null,null,null,null,null,null,null,null,null,null,null,null,null,null,null,null,null,null,"Tỉnh Quảng Trị","Huyện đảo Cồn Cỏ","IV"]
[null,null,null,null,null,null,null,null,null,null,null,null,null,null,null,null,null,null,null,null,null,null,null,null,"Tỉnh Quảng Trị","Thành phố Đông Hà","III"]
[null,null,null,null,null,null,null,null,null,null,null,null,null,null,null,null,null,null,null,null,null,null,null,null,"Tỉnh Quảng Trị","Thị xã Quảng Trị","IV"]
[null,null,null,null,null,null,null,null,null,null,null,null,null,null,null,null,null,null,null,null,null,null,null,null,"Tỉnh Quảng Trị","Huyện Cam Lộ","IV"]
[null,null,null,null,null,null,null,null,null,null,null,null,null,null,null,null,null,null,null,null,null,null,null,null,"Tỉnh Quảng Trị","Huyện Triệu Phong","IV"]
[null,null,null,null,null,null,null,null,null,null,null,null,null,null,null,null,null,null,null,null,null,null,null,null,"Tỉnh Quảng Trị","Huyện Hải Lăng","IV"]
[null,null,null,null,null,null,null,null,null,null,null,null,null,null,null,null,null,null,null,null,null,null,null,null,"Tỉnh Quảng Trị","Huyện Gio Linh","IV"]
[null,null,null,null,null,null,null,null,null,null,null,null,null,null,null,null,null,null,null,null,null,null,null,null,"Tỉnh Quảng Trị","Huyện Vĩnh Linh","IV"]
[null,null,null,null,null,null,null,null,null,null,null,null,null,null,null,null,null,null,null,null,null,null,null,null,"Tỉnh Quảng Trị","Huyện Hướng Hóa","IV"]
[null,null,null,null,null,null,null,null,null,null,null,null,null,null,null,null,null,null,null,null,null,null,null,null,"Tỉnh Quảng Trị","Huyện Đa Krông","IV"]
[null,null,null,null,null,null,null,null,null,null,null,null,null,null,null,null,null,null,null,null,null,null,null,null,"Tỉnh Sóc Trăng","Thành phố Sóc Trăng","III"]
[null,null,null,null,null,null,null,null,null,null,null,null,null,null,null,null,null,null,null,null,null,null,null,null,"Tỉnh Sóc Trăng","Huyện Châu Thành (ST)","IV"]
[null,null,null,null,null,null,null,null,null,null,null,null,null,null,null,null,null,null,null,null,null,null,null,null,"Tỉnh Sóc Trăng","Thị xã Ngã Năm","III","theo 122"]
[null,null,null,null,null,null,null,null,null,null,null,null,null,null,null,null,null,null,null,null,null,null,null,null,"Tỉnh Sóc Trăng","Huyện Cù Lao Dung","IV"]
[null,null,null,null,null,null,null,null,null,null,null,null,null,null,null,null,null,null,null,null,null,null,null,null,"Tỉnh Sóc Trăng","Huyện Mỹ Xuyên","IV"]
[null,null,null,null,null,null,null,null,null,null,null,null,null,null,null,null,null,null,null,null,null,null,null,null,"Tỉnh Sóc Trăng","Huyện Long Phú","IV"]
[null,null,null,null,null,null,null,null,null,null,null,null,null,null,null,null,null,null,null,null,null,null,null,null,"Tỉnh Sóc Trăng","Huyện Thạnh Trị","IV"]
[null,null,null,null,null,null,null,null,null,null,null,null,null,null,null,null,null,null,null,null,null,null,null,null,"Tỉnh Sóc Trăng","Huyện Kế Sách","IV"]
[null,null,null,null,null,null,null,null,null,null,null,null,null,null,null,null,null,null,null,null,null,null,null,null,"Tỉnh Sóc Trăng","Huyện Mỹ Tú","IV"]
[null,null,null,null,null,null,null,null,null,null,null,null,null,null,null,null,null,null,null,null,null,null,null,null,"Tỉnh Sóc Trăng","Huyện Trần Đề","IV"]
[null,null,null,null,null,null,null,null,null,null,null,null,null,null,null,null,null,null,null,null,null,null,null,null,"Tỉnh Sóc Trăng","Thị xã Vĩnh Châu","III","theo 122"]
[null,null,null,null,null,null,null,null,null,null,null,null,null,null,null,null,null,null,null,null,null,null,null,null,"Tỉnh Sơn La","Thành phố Sơn La","III"]
[null,null,null,null,null,null,null,null,null,null,null,null,null,null,null,null,null,null,null,null,null,null,null,null,"Tỉnh Sơn La","Huyện Yên Châu","IV"]
[null,null,null,null,null,null,null,null,null,null,null,null,null,null,null,null,null,null,null,null,null,null,null,null,"Tỉnh Sơn La","Huyện Vân Hồ","IV"]
[null,null,null,null,null,null,null,null,null,null,null,null,null,null,null,null,null,null,null,null,null,null,null,null,"Tỉnh Sơn La","Huyện Quỳnh Nhai","IV"]
[null,null,null,null,null,null,null,null,null,null,null,null,null,null,null,null,null,null,null,null,null,null,null,null,"Tỉnh Sơn La","Huyện Mộc Châu","IV"]
[null,null,null,null,null,null,null,null,null,null,null,null,null,null,null,null,null,null,null,null,null,null,null,null,"Tỉnh Sơn La","Huyện Bắc Yên","IV"]
[null,null,null,null,null,null,null,null,null,null,null,null,null,null,null,null,null,null,null,null,null,null,null,null,"Tỉnh Sơn La","Huyện Phù Yên","IV"]
[null,null,null,null,null,null,null,null,null,null,null,null,null,null,null,null,null,null,null,null,null,null,null,null,"Tỉnh Sơn La","Huyện Mai Sơn","IV"]
[null,null,null,null,null,null,null,null,null,null,null,null,null,null,null,null,null,null,null,null,null,null,null,null,"Tỉnh Sơn La","Huyện Mường La","IV"]
[null,null,null,null,null,null,null,null,null,null,null,null,null,null,null,null,null,null,null,null,null,null,null,null,"Tỉnh Sơn La","Huyện Sốp Cộp","IV"]
[null,null,null,null,null,null,null,null,null,null,null,null,null,null,null,null,null,null,null,null,null,null,null,null,"Tỉnh Sơn La","Huyện Thuận Châu","IV"]
[null,null,null,null,null,null,null,null,null,null,null,null,null,null,null,null,null,null,null,null,null,null,null,null,"Tỉnh Sơn La","Huyện Sông Mã","IV"]
[null,null,null,null,null,null,null,null,null,null,null,null,null,null,null,null,null,null,null,null,null,null,null,null,"Tỉnh Thanh Hóa","Thị xã Sầm Sơn","IV"]
[null,null,null,null,null,null,null,null,null,null,null,null,null,null,null,null,null,null,null,null,null,null,null,null,"Tỉnh Thanh Hóa","Thị xã Bỉm Sơn","III"]
[null,null,null,null,null,null,null,null,null,null,null,null,null,null,null,null,null,null,null,null,null,null,null,null,"Tỉnh Thanh Hóa","Huyện Đông Sơn","IV"]
[null,null,null,null,null,null,null,null,null,null,null,null,null,null,null,null,null,null,null,null,null,null,null,null,"Tỉnh Thanh Hóa","Huyện Hậu Lộc","IV"]
[null,null,null,null,null,null,null,null,null,null,null,null,null,null,null,null,null,null,null,null,null,null,null,null,"Tỉnh Thanh Hóa","Thành phố Thanh Hóa","III"]
[null,null,null,null,null,null,null,null,null,null,null,null,null,null,null,null,null,null,null,null,null,null,null,null,"Tỉnh Thanh Hóa","Huyện Vĩnh Lộc","IV"]
[null,null,null,null,null,null,null,null,null,null,null,null,null,null,null,null,null,null,null,null,null,null,null,null,"Tỉnh Thanh Hóa","Huyện Nga Sơn","IV"]
[null,null,null,null,null,null,null,null,null,null,null,null,null,null,null,null,null,null,null,null,null,null,null,null,"Tỉnh Thanh Hóa","Huyện Thiệu Hóa","IV"]
[null,null,null,null,null,null,null,null,null,null,null,null,null,null,null,null,null,null,null,null,null,null,null,null,"Tỉnh Thanh Hóa","Huyện Quảng Xương","IV"]
[null,null,null,null,null,null,null,null,null,null,null,null,null,null,null,null,null,null,null,null,null,null,null,null,"Tỉnh Thanh Hóa","Huyện Hoằng Hóa","IV"]
[null,null,null,null,null,null,null,null,null,null,null,null,null,null,null,null,null,null,null,null,null,null,null,null,"Tỉnh Thanh Hóa","Huyện Yên Định","IV"]
[null,null,null,null,null,null,null,null,null,null,null,null,null,null,null,null,null,null,null,null,null,null,null,null,"Tỉnh Thanh Hóa","Huyện Hà Trung","IV"]
[null,null,null,null,null,null,null,null,null,null,null,null,null,null,null,null,null,null,null,null,null,null,null,null,"Tỉnh Thanh Hóa","Huyện Nông Cống","IV"]
[null,null,null,null,null,null,null,null,null,null,null,null,null,null,null,null,null,null,null,null,null,null,null,null,"Tỉnh Thanh Hóa","Huyện Triệu Sơn","IV"]
[null,null,null,null,null,null,null,null,null,null,null,null,null,null,null,null,null,null,null,null,null,null,null,null,"Tỉnh Thanh Hóa","Huyện Thọ Xuân","IV"]
[null,null,null,null,null,null,null,null,null,null,null,null,null,null,null,null,null,null,null,null,null,null,null,null,"Tỉnh Thanh Hóa","Huyện Cẩm Thủy","IV"]
[null,null,null,null,null,null,null,null,null,null,null,null,null,null,null,null,null,null,null,null,null,null,null,null,"Tỉnh Thanh Hóa","Huyện Tĩnh Gia","III"]
[null,null,null,null,null,null,null,null,null,null,null,null,null,null,null,null,null,null,null,null,null,null,null,null,"Tỉnh Thanh Hóa","Huyện Ngọc Lặc","IV"]
[null,null,null,null,null,null,null,null,null,null,null,null,null,null,null,null,null,null,null,null,null,null,null,null,"Tỉnh Thanh Hóa","Huyện Thạch Thành","IV"]
[null,null,null,null,null,null,null,null,null,null,null,null,null,null,null,null,null,null,null,null,null,null,null,null,"Tỉnh Thanh Hóa","Huyện Như Thanh","IV"]
[null,null,null,null,null,null,null,null,null,null,null,null,null,null,null,null,null,null,null,null,null,null,null,null,"Tỉnh Thanh Hóa","Huyện Lang Chánh","IV"]
[null,null,null,null,null,null,null,null,null,null,null,null,null,null,null,null,null,null,null,null,null,null,null,null,"Tỉnh Thanh Hóa","Huyện Như Xuân","IV"]
[null,null,null,null,null,null,null,null,null,null,null,null,null,null,null,null,null,null,null,null,null,null,null,null,"Tỉnh Thanh Hóa","Huyện Bá Thước","IV"]
[null,null,null,null,null,null,null,null,null,null,null,null,null,null,null,null,null,null,null,null,null,null,null,null,"Tỉnh Thanh Hóa","Huyện Mường Lát","IV"]
[null,null,null,null,null,null,null,null,null,null,null,null,null,null,null,null,null,null,null,null,null,null,null,null,"Tỉnh Thanh Hóa","Huyện Quan Sơn","IV"]
[null,null,null,null,null,null,null,null,null,null,null,null,null,null,null,null,null,null,null,null,null,null,null,null,"Tỉnh Thanh Hóa","Huyện Quan Hóa","IV"]
[null,null,null,null,null,null,null,null,null,null,null,null,null,null,null,null,null,null,null,null,null,null,null,null,"Tỉnh Thanh Hóa","Huyện Thường Xuân","IV"]
[null,null,null,null,null,null,null,null,null,null,null,null,null,null,null,null,null,null,null,null,null,null,null,null,"Tỉnh Thái Bình","Thành phố Thái Bình","III"]
[null,null,null,null,null,null,null,null,null,null,null,null,null,null,null,null,null,null,null,null,null,null,null,null,"Tỉnh Thái Bình","Huyện Đông Hưng","IV"]
[null,null,null,null,null,null,null,null,null,null,null,null,null,null,null,null,null,null,null,null,null,null,null,null,"Tỉnh Thái Bình","Huyện Vũ Thư","IV"]
[null,null,null,null,null,null,null,null,null,null,null,null,null,null,null,null,null,null,null,null,null,null,null,null,"Tỉnh Thái Bình","Huyện Kiến Xương","IV"]
[null,null,null,null,null,null,null,null,null,null,null,null,null,null,null,null,null,null,null,null,null,null,null,null,"Tỉnh Thái Bình","Huyện Hưng Hà","IV"]
[null,null,null,null,null,null,null,null,null,null,null,null,null,null,null,null,null,null,null,null,null,null,null,null,"Tỉnh Thái Bình","Huyện Quỳnh Phụ","IV"]
[null,null,null,null,null,null,null,null,null,null,null,null,null,null,null,null,null,null,null,null,null,null,null,null,"Tỉnh Thái Bình","Huyện Tiền Hải","IV"]
[null,null,null,null,null,null,null,null,null,null,null,null,null,null,null,null,null,null,null,null,null,null,null,null,"Tỉnh Thái Bình","Huyện Thái Thụy","IV"]
[null,null,null,null,null,null,null,null,null,null,null,null,null,null,null,null,null,null,null,null,null,null,null,null,"Tỉnh Thái Nguyên","Thị xã Sông Công","III"]
[null,null,null,null,null,null,null,null,null,null,null,null,null,null,null,null,null,null,null,null,null,null,null,null,"Tỉnh Thái Nguyên","Thành phố Thái Nguyên","II"]
[null,null,null,null,null,null,null,null,null,null,null,null,null,null,null,null,null,null,null,null,null,null,null,null,"Tỉnh Thái Nguyên","Huyện Phú Bình","III"]
[null,null,null,null,null,null,null,null,null,null,null,null,null,null,null,null,null,null,null,null,null,null,null,null,"Tỉnh Thái Nguyên","Huyện Phổ Yên","III"]
[null,null,null,null,null,null,null,null,null,null,null,null,null,null,null,null,null,null,null,null,null,null,null,null,"Tỉnh Thái Nguyên","Huyện Phú Lương","III"]
[null,null,null,null,null,null,null,null,null,null,null,null,null,null,null,null,null,null,null,null,null,null,null,null,"Tỉnh Thái Nguyên","Huyện Đồng Hỷ","III"]
[null,null,null,null,null,null,null,null,null,null,null,null,null,null,null,null,null,null,null,null,null,null,null,null,"Tỉnh Thái Nguyên","Huyện Định Hóa","IV"]
[null,null,null,null,null,null,null,null,null,null,null,null,null,null,null,null,null,null,null,null,null,null,null,null,"Tỉnh Thái Nguyên","Huyện Đại Từ","III"]
[null,null,null,null,null,null,null,null,null,null,null,null,null,null,null,null,null,null,null,null,null,null,null,null,"Tỉnh Thái Nguyên","Huyện Võ Nhai","IV"]
[null,null,null,null,null,null,null,null,null,null,null,null,null,null,null,null,null,null,null,null,null,null,null,null,"Tỉnh Thừa Thiên-Huế","Thành phố Huế","II"]
[null,null,null,null,null,null,null,null,null,null,null,null,null,null,null,null,null,null,null,null,null,null,null,null,"Tỉnh Thừa Thiên-Huế","Thị xã Hương Thủy","III"]
[null,null,null,null,null,null,null,null,null,null,null,null,null,null,null,null,null,null,null,null,null,null,null,null,"Tỉnh Thừa Thiên-Huế","Thị xã Hương Trà","III"]
[null,null,null,null,null,null,null,null,null,null,null,null,null,null,null,null,null,null,null,null,null,null,null,null,"Tỉnh Thừa Thiên-Huế","Huyện Nam Đông","IV"]
[null,null,null,null,null,null,null,null,null,null,null,null,null,null,null,null,null,null,null,null,null,null,null,null,"Tỉnh Thừa Thiên-Huế","Huyện Quảng Điền","III"]
[null,null,null,null,null,null,null,null,null,null,null,null,null,null,null,null,null,null,null,null,null,null,null,null,"Tỉnh Thừa Thiên-Huế","Huyện Phú Vang","III"]
[null,null,null,null,null,null,null,null,null,null,null,null,null,null,null,null,null,null,null,null,null,null,null,null,"Tỉnh Thừa Thiên-Huế","Huyện Phú Lộc","III"]
[null,null,null,null,null,null,null,null,null,null,null,null,null,null,null,null,null,null,null,null,null,null,null,null,"Tỉnh Thừa Thiên-Huế","Huyện Phong Điền ","III"]
[null,null,null,null,null,null,null,null,null,null,null,null,null,null,null,null,null,null,null,null,null,null,null,null,"Tỉnh Thừa Thiên-Huế","Huyện A Lưới","IV"]
[null,null,null,null,null,null,null,null,null,null,null,null,null,null,null,null,null,null,null,null,null,null,null,null,"Tỉnh Tiền Giang","Thành phố Mỹ Tho","II"]
[null,null,null,null,null,null,null,null,null,null,null,null,null,null,null,null,null,null,null,null,null,null,null,null,"Tỉnh Tiền Giang","Thị xã Gò Công","III"]
[null,null,null,null,null,null,null,null,null,null,null,null,null,null,null,null,null,null,null,null,null,null,null,null,"Tỉnh Tiền Giang","Thị xã Cai Lậy","III","theo 122"]
[null,null,null,null,null,null,null,null,null,null,null,null,null,null,null,null,null,null,null,null,null,null,null,null,"Tỉnh Tiền Giang","Huyện Gò Công Tây","IV"]
[null,null,null,null,null,null,null,null,null,null,null,null,null,null,null,null,null,null,null,null,null,null,null,null,"Tỉnh Tiền Giang","Huyện Tân Phú Đông","IV"]
[null,null,null,null,null,null,null,null,null,null,null,null,null,null,null,null,null,null,null,null,null,null,null,null,"Tỉnh Tiền Giang","Huyện Chợ Gạo","III","theo 122"]
[null,null,null,null,null,null,null,null,null,null,null,null,null,null,null,null,null,null,null,null,null,null,null,null,"Tỉnh Tiền Giang","Huyện Châu Thành (TG)","III"]
[null,null,null,null,null,null,null,null,null,null,null,null,null,null,null,null,null,null,null,null,null,null,null,null,"Tỉnh Tiền Giang","Huyện Cai Lậy","IV"]
[null,null,null,null,null,null,null,null,null,null,null,null,null,null,null,null,null,null,null,null,null,null,null,null,"Tỉnh Tiền Giang","Huyện Cái Bè","IV"]
[null,null,null,null,null,null,null,null,null,null,null,null,null,null,null,null,null,null,null,null,null,null,null,null,"Tỉnh Tiền Giang","Huyện Gò Công Đông","IV"]
[null,null,null,null,null,null,null,null,null,null,null,null,null,null,null,null,null,null,null,null,null,null,null,null,"Tỉnh Tiền Giang","Huyện Tân Phước","IV"]
[null,null,null,null,null,null,null,null,null,null,null,null,null,null,null,null,null,null,null,null,null,null,null,null,"Thành phố Hồ Chí Minh","Quận 4","I"]
[null,null,null,null,null,null,null,null,null,null,null,null,null,null,null,null,null,null,null,null,null,null,null,null,"Thành phố Hồ Chí Minh","Quận 5","I"]
[null,null,null,null,null,null,null,null,null,null,null,null,null,null,null,null,null,null,null,null,null,null,null,null,"Thành phố Hồ Chí Minh","Quận Phú Nhuận","I"]
[null,null,null,null,null,null,null,null,null,null,null,null,null,null,null,null,null,null,null,null,null,null,null,null,"Thành phố Hồ Chí Minh","Quận 3","I"]
[null,null,null,null,null,null,null,null,null,null,null,null,null,null,null,null,null,null,null,null,null,null,null,null,"Thành phố Hồ Chí Minh","Quận 11","I"]
[null,null,null,null,null,null,null,null,null,null,null,null,null,null,null,null,null,null,null,null,null,null,null,null,"Thành phố Hồ Chí Minh","Quận 10","I"]
[null,null,null,null,null,null,null,null,null,null,null,null,null,null,null,null,null,null,null,null,null,null,null,null,"Thành phố Hồ Chí Minh","Quận 6","I"]
[null,null,null,null,null,null,null,null,null,null,null,null,null,null,null,null,null,null,null,null,null,null,null,null,"Thành phố Hồ Chí Minh","Quận 1","I"]
[null,null,null,null,null,null,null,null,null,null,null,null,null,null,null,null,null,null,null,null,null,null,null,null,"Thành phố Hồ Chí Minh","Quận Tân Phú","I"]
[null,null,null,null,null,null,null,null,null,null,null,null,null,null,null,null,null,null,null,null,null,null,null,null,"Thành phố Hồ Chí Minh","Quận 8","I"]
[null,null,null,null,null,null,null,null,null,null,null,null,null,null,null,null,null,null,null,null,null,null,null,null,"Thành phố Hồ Chí Minh","Quận Gò Vấp","I"]
[null,null,null,null,null,null,null,null,null,null,null,null,null,null,null,null,null,null,null,null,null,null,null,null,"Thành phố Hồ Chí Minh","Quận Bình Thạnh","I"]
[null,null,null,null,null,null,null,null,null,null,null,null,null,null,null,null,null,null,null,null,null,null,null,null,"Thành phố Hồ Chí Minh","Quận Tân Bình","I"]
[null,null,null,null,null,null,null,null,null,null,null,null,null,null,null,null,null,null,null,null,null,null,null,null,"Thành phố Hồ Chí Minh","Quận 7","I"]
[null,null,null,null,null,null,null,null,null,null,null,null,null,null,null,null,null,null,null,null,null,null,null,null,"Thành phố Hồ Chí Minh","Quận Thủ Đức","I"]
[null,null,null,null,null,null,null,null,null,null,null,null,null,null,null,null,null,null,null,null,null,null,null,null,"Thành phố Hồ Chí Minh","Quận 2","I"]
[null,null,null,null,null,null,null,null,null,null,null,null,null,null,null,null,null,null,null,null,null,null,null,null,"Thành phố Hồ Chí Minh","Quận Bình Tân","I"]
[null,null,null,null,null,null,null,null,null,null,null,null,null,null,null,null,null,null,null,null,null,null,null,null,"Thành phố Hồ Chí Minh","Quận 12","I"]
[null,null,null,null,null,null,null,null,null,null,null,null,null,null,null,null,null,null,null,null,null,null,null,null,"Thành phố Hồ Chí Minh","Huyện Nhà Bè","I"]
[null,null,null,null,null,null,null,null,null,null,null,null,null,null,null,null,null,null,null,null,null,null,null,null,"Thành phố Hồ Chí Minh","Huyện Hóc Môn","I"]
[null,null,null,null,null,null,null,null,null,null,null,null,null,null,null,null,null,null,null,null,null,null,null,null,"Thành phố Hồ Chí Minh","Quận 9","I"]
[null,null,null,null,null,null,null,null,null,null,null,null,null,null,null,null,null,null,null,null,null,null,null,null,"Thành phố Hồ Chí Minh","Huyện Bình Chánh","I"]
[null,null,null,null,null,null,null,null,null,null,null,null,null,null,null,null,null,null,null,null,null,null,null,null,"Thành phố Hồ Chí Minh","Huyện Củ Chi","I"]
[null,null,null,null,null,null,null,null,null,null,null,null,null,null,null,null,null,null,null,null,null,null,null,null,"Thành phố Hồ Chí Minh","Huyện Cần Giờ","II"]
[null,null,null,null,null,null,null,null,null,null,null,null,null,null,null,null,null,null,null,null,null,null,null,null,"Tỉnh Trà Vinh","Thành phố Trà Vinh","III"]
[null,null,null,null,null,null,null,null,null,null,null,null,null,null,null,null,null,null,null,null,null,null,null,null,"Tỉnh Trà Vinh","Huyện Tiểu Cần","IV"]
[null,null,null,null,null,null,null,null,null,null,null,null,null,null,null,null,null,null,null,null,null,null,null,null,"Tỉnh Trà Vinh","Huyện Cầu Kè","IV"]
[null,null,null,null,null,null,null,null,null,null,null,null,null,null,null,null,null,null,null,null,null,null,null,null,"Tỉnh Trà Vinh","Huyện Càng Long","IV"]
[null,null,null,null,null,null,null,null,null,null,null,null,null,null,null,null,null,null,null,null,null,null,null,null,"Tỉnh Trà Vinh","Huyện Cầu Ngang","IV"]
[null,null,null,null,null,null,null,null,null,null,null,null,null,null,null,null,null,null,null,null,null,null,null,null,"Tỉnh Trà Vinh","Huyện Châu Thành (TV)","IV"]
[null,null,null,null,null,null,null,null,null,null,null,null,null,null,null,null,null,null,null,null,null,null,null,null,"Tỉnh Trà Vinh","Huyện Trà Cú","IV"]
[null,null,null,null,null,null,null,null,null,null,null,null,null,null,null,null,null,null,null,null,null,null,null,null,"Tỉnh Trà Vinh","Huyện Duyên Hải","IV"]
[null,null,null,null,null,null,null,null,null,null,null,null,null,null,null,null,null,null,null,null,null,null,null,null,"Tỉnh Tuyên Quang","Thành phố Tuyên Quang","III"]
[null,null,null,null,null,null,null,null,null,null,null,null,null,null,null,null,null,null,null,null,null,null,null,null,"Tỉnh Tuyên Quang","Huyện Lâm Bình","IV"]
[null,null,null,null,null,null,null,null,null,null,null,null,null,null,null,null,null,null,null,null,null,null,null,null,"Tỉnh Tuyên Quang","Huyện Sơn Dương","IV"]
[null,null,null,null,null,null,null,null,null,null,null,null,null,null,null,null,null,null,null,null,null,null,null,null,"Tỉnh Tuyên Quang","Huyện Na Hang","IV"]
[null,null,null,null,null,null,null,null,null,null,null,null,null,null,null,null,null,null,null,null,null,null,null,null,"Tỉnh Tuyên Quang","Huyện Hàm Yên","IV"]
[null,null,null,null,null,null,null,null,null,null,null,null,null,null,null,null,null,null,null,null,null,null,null,null,"Tỉnh Tuyên Quang","Huyện Yên Sơn","IV"]
[null,null,null,null,null,null,null,null,null,null,null,null,null,null,null,null,null,null,null,null,null,null,null,null,"Tỉnh Tuyên Quang","Huyện Chiêm Hóa","IV"]
[null,null,null,null,null,null,null,null,null,null,null,null,null,null,null,null,null,null,null,null,null,null,null,null,"Tỉnh Tây Ninh","Huyện Hòa Thành","III"]
[null,null,null,null,null,null,null,null,null,null,null,null,null,null,null,null,null,null,null,null,null,null,null,null,"Tỉnh Tây Ninh","Thành phố Tây Ninh","II"]
[null,null,null,null,null,null,null,null,null,null,null,null,null,null,null,null,null,null,null,null,null,null,null,null,"Tỉnh Tây Ninh","Huyện Bến Cầu","III"]
[null,null,null,null,null,null,null,null,null,null,null,null,null,null,null,null,null,null,null,null,null,null,null,null,"Tỉnh Tây Ninh","Huyện Gò Dầu","II"]
[null,null,null,null,null,null,null,null,null,null,null,null,null,null,null,null,null,null,null,null,null,null,null,null,"Tỉnh Tây Ninh","Huyện Trảng Bàng","II"]
[null,null,null,null,null,null,null,null,null,null,null,null,null,null,null,null,null,null,null,null,null,null,null,null,"Tỉnh Tây Ninh","Huyện Dương Minh Châu","III"]
[null,null,null,null,null,null,null,null,null,null,null,null,null,null,null,null,null,null,null,null,null,null,null,null,"Tỉnh Tây Ninh","Huyện Châu Thành (TN)","III"]
[null,null,null,null,null,null,null,null,null,null,null,null,null,null,null,null,null,null,null,null,null,null,null,null,"Tỉnh Tây Ninh","Huyện Tân Biên","III"]
[null,null,null,null,null,null,null,null,null,null,null,null,null,null,null,null,null,null,null,null,null,null,null,null,"Tỉnh Tây Ninh","Huyện Tân Châu","III"]
[null,null,null,null,null,null,null,null,null,null,null,null,null,null,null,null,null,null,null,null,null,null,null,null,"Tỉnh Vĩnh Long","Thành phố Vĩnh Long","III"]
[null,null,null,null,null,null,null,null,null,null,null,null,null,null,null,null,null,null,null,null,null,null,null,null,"Tỉnh Vĩnh Long","Thị xã Bình Minh","III"]
[null,null,null,null,null,null,null,null,null,null,null,null,null,null,null,null,null,null,null,null,null,null,null,null,"Tỉnh Vĩnh Long","Huyện Bình Tân","IV"]
[null,null,null,null,null,null,null,null,null,null,null,null,null,null,null,null,null,null,null,null,null,null,null,null,"Tỉnh Vĩnh Long","Huyện Mang Thít","IV"]
[null,null,null,null,null,null,null,null,null,null,null,null,null,null,null,null,null,null,null,null,null,null,null,null,"Tỉnh Vĩnh Long","Huyện Long Hồ","III"]
[null,null,null,null,null,null,null,null,null,null,null,null,null,null,null,null,null,null,null,null,null,null,null,null,"Tỉnh Vĩnh Long","Huyện Trà Ôn","IV"]
[null,null,null,null,null,null,null,null,null,null,null,null,null,null,null,null,null,null,null,null,null,null,null,null,"Tỉnh Vĩnh Long","Huyện Tam Bình","IV"]
[null,null,null,null,null,null,null,null,null,null,null,null,null,null,null,null,null,null,null,null,null,null,null,null,"Tỉnh Vĩnh Long","Huyện Vũng Liêm","IV"]
[null,null,null,null,null,null,null,null,null,null,null,null,null,null,null,null,null,null,null,null,null,null,null,null,"Tỉnh Vĩnh Phúc","Thành phố Vĩnh Yên","II"]
[null,null,null,null,null,null,null,null,null,null,null,null,null,null,null,null,null,null,null,null,null,null,null,null,"Tỉnh Vĩnh Phúc","Huyện Yên Lạc","II"]
[null,null,null,null,null,null,null,null,null,null,null,null,null,null,null,null,null,null,null,null,null,null,null,null,"Tỉnh Vĩnh Phúc","Huyện Tam Dương","III"]
[null,null,null,null,null,null,null,null,null,null,null,null,null,null,null,null,null,null,null,null,null,null,null,null,"Tỉnh Vĩnh Phúc","Thị xã Phúc Yên","II"]
[null,null,null,null,null,null,null,null,null,null,null,null,null,null,null,null,null,null,null,null,null,null,null,null,"Tỉnh Vĩnh Phúc","Huyện Vĩnh Tường","III"]
[null,null,null,null,null,null,null,null,null,null,null,null,null,null,null,null,null,null,null,null,null,null,null,null,"Tỉnh Vĩnh Phúc","Huyện Bình Xuyên","II"]
[null,null,null,null,null,null,null,null,null,null,null,null,null,null,null,null,null,null,null,null,null,null,null,null,"Tỉnh Vĩnh Phúc","Huyện Sông Lô","III"]
[null,null,null,null,null,null,null,null,null,null,null,null,null,null,null,null,null,null,null,null,null,null,null,null,"Tỉnh Vĩnh Phúc","Huyện Lập Thạch","III"]
[null,null,null,null,null,null,null,null,null,null,null,null,null,null,null,null,null,null,null,null,null,null,null,null,"Tỉnh Vĩnh Phúc","Huyện Tam Đảo","III"]
[null,null,null,null,null,null,null,null,null,null,null,null,null,null,null,null,null,null,null,null,null,null,null,null,"Tỉnh Yên Bái","Thị xã Nghĩa Lộ","IV"]
[null,null,null,null,null,null,null,null,null,null,null,null,null,null,null,null,null,null,null,null,null,null,null,null,"Tỉnh Yên Bái","Thành phố Yên Bái","III"]
[null,null,null,null,null,null,null,null,null,null,null,null,null,null,null,null,null,null,null,null,null,null,null,null,"Tỉnh Yên Bái","Huyện Trấn Yên","IV"]
[null,null,null,null,null,null,null,null,null,null,null,null,null,null,null,null,null,null,null,null,null,null,null,null,"Tỉnh Yên Bái","Huyện Trạm Tấu","IV"]
[null,null,null,null,null,null,null,null,null,null,null,null,null,null,null,null,null,null,null,null,null,null,null,null,"Tỉnh Yên Bái","Huyện Yên Bình","IV"]
[null,null,null,null,null,null,null,null,null,null,null,null,null,null,null,null,null,null,null,null,null,null,null,null,"Tỉnh Yên Bái","Huyện Lục Yên","IV"]
[null,null,null,null,null,null,null,null,null,null,null,null,null,null,null,null,null,null,null,null,null,null,null,null,"Tỉnh Yên Bái","Huyện Mù Căng Chải","IV"]
[null,null,null,null,null,null,null,null,null,null,null,null,null,null,null,null,null,null,null,null,null,null,null,null,"Tỉnh Yên Bái","Huyện Văn Chấn","IV"]
[null,null,null,null,null,null,null,null,null,null,null,null,null,null,null,null,null,null,null,null,null,null,null,null,"Tỉnh Yên Bái","Huyện Văn Yên","IV"]
[null,null,null,null,null,null,null,null,null,null,null,null,null,null,null,null,null,null,null,null,null,null,null,null,"Tỉnh Điện Biên","Thành phố Điện Biên Phủ","III"]
[null,null,null,null,null,null,null,null,null,null,null,null,null,null,null,null,null,null,null,null,null,null,null,null,"Tỉnh Điện Biên","Thị xã Mường Lay","IV"]
[null,null,null,null,null,null,null,null,null,null,null,null,null,null,null,null,null,null,null,null,null,null,null,null,"Tỉnh Điện Biên","Huyện Mường Ảng","IV"]
[null,null,null,null,null,null,null,null,null,null,null,null,null,null,null,null,null,null,null,null,null,null,null,null,"Tỉnh Điện Biên","Huyện Tủa Chùa","IV"]
[null,null,null,null,null,null,null,null,null,null,null,null,null,null,null,null,null,null,null,null,null,null,null,null,"Tỉnh Điện Biên","Huyện Tuần Giáo","IV"]
[null,null,null,null,null,null,null,null,null,null,null,null,null,null,null,null,null,null,null,null,null,null,null,null,"Tỉnh Điện Biên","Huyện Mường Chà","IV"]
[null,null,null,null,null,null,null,null,null,null,null,null,null,null,null,null,null,null,null,null,null,null,null,null,"Tỉnh Điện Biên","Huyện Điện Biên Đông","IV"]
[null,null,null,null,null,null,null,null,null,null,null,null,null,null,null,null,null,null,null,null,null,null,null,null,"Tỉnh Điện Biên","Huyện Nậm Pồ","IV"]
[null,null,null,null,null,null,null,null,null,null,null,null,null,null,null,null,null,null,null,null,null,null,null,null,"Tỉnh Điện Biên","Huyện Mường Nhé","IV"]
[null,null,null,null,null,null,null,null,null,null,null,null,null,null,null,null,null,null,null,null,null,null,null,null,"Tỉnh Điện Biên","Huyện Điện Biên","IV"]
[null,null,null,null,null,null,null,null,null,null,null,null,null,null,null,null,null,null,null,null,null,null,null,null,"Thành phố Đà Nẵng","Quận Thanh Khê","II"]
[null,null,null,null,null,null,null,null,null,null,null,null,null,null,null,null,null,null,null,null,null,null,null,null,"Thành phố Đà Nẵng","Quận Hải Châu","II"]
[null,null,null,null,null,null,null,null,null,null,null,null,null,null,null,null,null,null,null,null,null,null,null,null,"Thành phố Đà Nẵng","Quận Cẩm Lệ","II"]
[null,null,null,null,null,null,null,null,null,null,null,null,null,null,null,null,null,null,null,null,null,null,null,null,"Thành phố Đà Nẵng","Quận Ngũ Hành Sơn","II"]
[null,null,null,null,null,null,null,null,null,null,null,null,null,null,null,null,null,null,null,null,null,null,null,null,"Thành phố Đà Nẵng","Quận Sơn Trà","II"]
[null,null,null,null,null,null,null,null,null,null,null,null,null,null,null,null,null,null,null,null,null,null,null,null,"Thành phố Đà Nẵng","Quận Liên Chiểu","II"]
[null,null,null,null,null,null,null,null,null,null,null,null,null,null,null,null,null,null,null,null,null,null,null,null,"Thành phố Đà Nẵng","Huyện đảo Hoàng Sa","II"]
[null,null,null,null,null,null,null,null,null,null,null,null,null,null,null,null,null,null,null,null,null,null,null,null,"Thành phố Đà Nẵng","Huyện Hoà Vang","II"]
[null,null,null,null,null,null,null,null,null,null,null,null,null,null,null,null,null,null,null,null,null,null,null,null,"Tỉnh Đăk Lăk","Thị xã Buôn Hồ","IV"]
[null,null,null,null,null,null,null,null,null,null,null,null,null,null,null,null,null,null,null,null,null,null,null,null,"Tỉnh Đăk Lăk","Huyện Cư Kuin","IV"]
[null,null,null,null,null,null,null,null,null,null,null,null,null,null,null,null,null,null,null,null,null,null,null,null,"Tỉnh Đăk Lăk","Huyện Krông Ana","IV"]
[null,null,null,null,null,null,null,null,null,null,null,null,null,null,null,null,null,null,null,null,null,null,null,null,"Tỉnh Đăk Lăk","Huyện Krông Búk","IV"]
[null,null,null,null,null,null,null,null,null,null,null,null,null,null,null,null,null,null,null,null,null,null,null,null,"Tỉnh Đăk Lăk","Thành phố Buôn Ma Thuột","III"]
[null,null,null,null,null,null,null,null,null,null,null,null,null,null,null,null,null,null,null,null,null,null,null,null,"Tỉnh Đăk Lăk","Huyện Krông Năng","IV"]
[null,null,null,null,null,null,null,null,null,null,null,null,null,null,null,null,null,null,null,null,null,null,null,null,"Tỉnh Đăk Lăk","Huyện Krông Pắk","IV"]
[null,null,null,null,null,null,null,null,null,null,null,null,null,null,null,null,null,null,null,null,null,null,null,null,"Tỉnh Đăk Lăk","Huyện Cư M'gar","IV"]
[null,null,null,null,null,null,null,null,null,null,null,null,null,null,null,null,null,null,null,null,null,null,null,null,"Tỉnh Đăk Lăk","Huyện Ea Kar","IV"]
[null,null,null,null,null,null,null,null,null,null,null,null,null,null,null,null,null,null,null,null,null,null,null,null,"Tỉnh Đăk Lăk","Huyện Lắk","IV"]
[null,null,null,null,null,null,null,null,null,null,null,null,null,null,null,null,null,null,null,null,null,null,null,null,"Tỉnh Đăk Lăk","Huyện Krông Bông","IV"]
[null,null,null,null,null,null,null,null,null,null,null,null,null,null,null,null,null,null,null,null,null,null,null,null,"Tỉnh Đăk Lăk","Huyện Ea H'leo","IV"]
[null,null,null,null,null,null,null,null,null,null,null,null,null,null,null,null,null,null,null,null,null,null,null,null,"Tỉnh Đăk Lăk","Huyện M'Đrăk","IV"]
[null,null,null,null,null,null,null,null,null,null,null,null,null,null,null,null,null,null,null,null,null,null,null,null,"Tỉnh Đăk Lăk","Huyện Buôn Đôn","IV"]
[null,null,null,null,null,null,null,null,null,null,null,null,null,null,null,null,null,null,null,null,null,null,null,null,"Tỉnh Đăk Lăk","Huyện Ea Súp","IV"]
[null,null,null,null,null,null,null,null,null,null,null,null,null,null,null,null,null,null,null,null,null,null,null,null,"Tỉnh Đăk Nông","Thị xã Gia Nghĩa","IV"]
[null,null,null,null,null,null,null,null,null,null,null,null,null,null,null,null,null,null,null,null,null,null,null,null,"Tỉnh Đăk Nông","Huyện Đăk R'Lấp","IV"]
[null,null,null,null,null,null,null,null,null,null,null,null,null,null,null,null,null,null,null,null,null,null,null,null,"Tỉnh Đăk Nông","Huyện Đăk Mil","IV"]
[null,null,null,null,null,null,null,null,null,null,null,null,null,null,null,null,null,null,null,null,null,null,null,null,"Tỉnh Đăk Nông","Huyện Cư Jút","IV"]
[null,null,null,null,null,null,null,null,null,null,null,null,null,null,null,null,null,null,null,null,null,null,null,null,"Tỉnh Đăk Nông","Huyện Krông Nô","IV"]
[null,null,null,null,null,null,null,null,null,null,null,null,null,null,null,null,null,null,null,null,null,null,null,null,"Tỉnh Đăk Nông","Huyện Đăk Song","IV"]
[null,null,null,null,null,null,null,null,null,null,null,null,null,null,null,null,null,null,null,null,null,null,null,null,"Tỉnh Đăk Nông","Huyện Tuy Đức","IV"]
[null,null,null,null,null,null,null,null,null,null,null,null,null,null,null,null,null,null,null,null,null,null,null,null,"Tỉnh Đăk Nông","Huyện Đăk Glong","IV"]
[null,null,null,null,null,null,null,null,null,null,null,null,null,null,null,null,null,null,null,null,null,null,null,null,"Tỉnh Đồng Nai","Thị xã Long Khánh","II"]
[null,null,null,null,null,null,null,null,null,null,null,null,null,null,null,null,null,null,null,null,null,null,null,null,"Tỉnh Đồng Nai","Huyện Thống Nhất","III"]
[null,null,null,null,null,null,null,null,null,null,null,null,null,null,null,null,null,null,null,null,null,null,null,null,"Tỉnh Đồng Nai","Thành phố Biên Hòa","I"]
[null,null,null,null,null,null,null,null,null,null,null,null,null,null,null,null,null,null,null,null,null,null,null,null,"Tỉnh Đồng Nai","Huyện Trảng Bom","I"]
[null,null,null,null,null,null,null,null,null,null,null,null,null,null,null,null,null,null,null,null,null,null,null,null,"Tỉnh Đồng Nai","Huyện Nhơn Trạch","I"]
[null,null,null,null,null,null,null,null,null,null,null,null,null,null,null,null,null,null,null,null,null,null,null,null,"Tỉnh Đồng Nai","Huyện Long Thành","I"]
[null,null,null,null,null,null,null,null,null,null,null,null,null,null,null,null,null,null,null,null,null,null,null,null,"Tỉnh Đồng Nai","Huyện Cẩm Mỹ","III"]
[null,null,null,null,null,null,null,null,null,null,null,null,null,null,null,null,null,null,null,null,null,null,null,null,"Tỉnh Đồng Nai","Huyện Xuân Lộc","II"]
[null,null,null,null,null,null,null,null,null,null,null,null,null,null,null,null,null,null,null,null,null,null,null,null,"Tỉnh Đồng Nai","Huyện Tân Phú","III"]
[null,null,null,null,null,null,null,null,null,null,null,null,null,null,null,null,null,null,null,null,null,null,null,null,"Tỉnh Đồng Nai","Huyện Định Quán","II"]
[null,null,null,null,null,null,null,null,null,null,null,null,null,null,null,null,null,null,null,null,null,null,null,null,"Tỉnh Đồng Nai","Huyện Vĩnh Cửu","I"]
[null,null,null,null,null,null,null,null,null,null,null,null,null,null,null,null,null,null,null,null,null,null,null,null,"Tỉnh Đồng Tháp","Thành phố Sa Đéc","III"]
[null,null,null,null,null,null,null,null,null,null,null,null,null,null,null,null,null,null,null,null,null,null,null,null,"Tỉnh Đồng Tháp","Thành phố Cao Lãnh","III"]
[null,null,null,null,null,null,null,null,null,null,null,null,null,null,null,null,null,null,null,null,null,null,null,null,"Tỉnh Đồng Tháp","Thị xã Hồng Ngự","IV"]
[null,null,null,null,null,null,null,null,null,null,null,null,null,null,null,null,null,null,null,null,null,null,null,null,"Tỉnh Đồng Tháp","Huyện Hồng Ngự","IV"]
[null,null,null,null,null,null,null,null,null,null,null,null,null,null,null,null,null,null,null,null,null,null,null,null,"Tỉnh Đồng Tháp","Huyện Lai Vung","IV"]
[null,null,null,null,null,null,null,null,null,null,null,null,null,null,null,null,null,null,null,null,null,null,null,null,"Tỉnh Đồng Tháp","Huyện Lấp Vò","IV"]
[null,null,null,null,null,null,null,null,null,null,null,null,null,null,null,null,null,null,null,null,null,null,null,null,"Tỉnh Đồng Tháp","Huyện Châu Thành (ĐTh)","IV"]
[null,null,null,null,null,null,null,null,null,null,null,null,null,null,null,null,null,null,null,null,null,null,null,null,"Tỉnh Đồng Tháp","Huyện Tân Hồng","IV"]
[null,null,null,null,null,null,null,null,null,null,null,null,null,null,null,null,null,null,null,null,null,null,null,null,"Tỉnh Đồng Tháp","Huyện Thanh Bình","IV"]
[null,null,null,null,null,null,null,null,null,null,null,null,null,null,null,null,null,null,null,null,null,null,null,null,"Tỉnh Đồng Tháp","Huyện Cao Lãnh","IV"]
[null,null,null,null,null,null,null,null,null,null,null,null,null,null,null,null,null,null,null,null,null,null,null,null,"Tỉnh Đồng Tháp","Huyện Tháp Mười","IV"]
[null,null,null,null,null,null,null,null,null,null,null,null,null,null,null,null,null,null,null,null,null,null,null,null,"Tỉnh Đồng Tháp","Huyện Tam Nông ","IV"]

{"sheet":"Bia","index":2,"n_rows":45,"n_cols":14,"rows_kept":45,"cut":false,"hidden":true,"merged":[[15,4,15,7]]}
[]
["CÔNG TY CP GIÁ XÂY DỰNG",null,null,null,null,"CỘNG HÒA XÃ HỘI CHỦ NGHĨA VIỆT NAM"]
["WWW.GIAXAYDUNG.VN",null,null,null,null,"Độc lập - Tự do - Hạnh phúc"]
[]
["          Số : ……./………."]
[]
[]
[]
["DỰ TOÁN XÂY DỰNG"]
[]
[null,null,null,"DỰ ÁN: ",{"$f":"UPPER(Ts!K4)","v":"HỆ THỐNG PHẦN MỀM CHUYÊN NGÀNH XÂY DỰNG - GXD"}]
[null,null,null,"CÔNG TRÌNH:",{"$f":"UPPER(Ts!K6)","v":"CÁC PHẦN MỀM QUẢN LÝ CHI PHÍ ĐTXD CT"}]
[null,null,null,"ĐỊA ĐIỂM:",{"$f":"E44","v":"SỐ 2A/55 NGUYỄN NGỌC NẠI, THANH XUÂN, HÀ NỘI"}]
[null,null,null,"CHỦ ĐẦU TƯ:",{"$f":"E45","v":"CÔNG TY CỔ PHẦN GIÁ XÂY DỰNG"}]
[]
[null,null,null,"Giá trị dự toán:",{"$f":"'Tong hop kinh phi'!H24","v":92057586000},null,null,null,"đồng"]
[null,null,null,{"$f":"\"(Bằng chữ: \"&vnd(E16)&\")\"","v":"(Bằng chữ: Chín mươi hai tỷ không trăm năm mươi bảy triệu năm trăm tám mươi sáu nghìn đồng.)"}]
[]
[]
[null,null,null,null,null,null,null,"Hà Nội, ","ngày",{"$f":"NOW()","v":"2016-04-11T17:22:51.280"},"tháng",{"$f":"NOW()","v":"2016-04-11T17:22:51.280"},"năm",{"$f":"NOW()","v":"2016-04-11T17:22:51.280"}]
[null,null,null,null,null,null,null,null,"GIÁM ĐỐC"]
[]
[]
[]
[]
[]
[null,null,null,null,null,null,null,null,"NGUYỄN THÀNH CÔNG"]
[]
[]
["CÔNG TY CP GIÁ XÂY DỰNG",null,null,null,null,"CỘNG HOÀ XÃ HỘI CHỦ NGHĨA VIỆT NAM"]
["WWW.GIAXAYDUNG.VN",null,null,null,null,"Độc lập - Tự do - Hạnh phúc"]
[]
[]
[]
[]
[]
[]
[]
["DỰ TOÁN XÂY DỰNG"]
["Số : ……./……."]
[]
[null,null,null,"CÔNG TRÌNH: ",{"$f":"IF(Ts!K6=\"\",\"\",UPPER(Ts!K6))","v":"CÁC PHẦN MỀM QUẢN LÝ CHI PHÍ ĐTXD CT"}]
[null,null,null,"HẠNG MỤC: ",{"$f":"IF(Ts!K8=\"\",\"\",UPPER(Ts!K8))","v":"PHẦN MỀM DỰ TOÁN GXD 10"}]
[null,null,null,"ĐỊA ĐIỂM:",{"$f":"UPPER(Ts!K10)","v":"SỐ 2A/55 NGUYỄN NGỌC NẠI, THANH XUÂN, HÀ NỘI"}]
[null,null,null,"CHỦ ĐẦU TƯ:",{"$f":"Ts!K12","v":"CÔNG TY CỔ PHẦN GIÁ XÂY DỰNG"}]

{"sheet":"Bia1","index":3,"n_rows":45,"n_cols":14,"rows_kept":45,"cut":false,"hidden":false,"merged":[[15,4,15,7]]}
[]
["CÔNG TY CP GIÁ XÂY DỰNG",null,null,null,null,"CỘNG HÒA XÃ HỘI CHỦ NGHĨA VIỆT NAM"]
["WWW.GIAXAYDUNG.VN",null,null,null,null,"Độc lập - Tự do - Hạnh phúc"]
[]
["          Số : ……./………."]
[]
[]
[]
["DỰ TOÁN CHI PHÍ XÂY DỰNG"]
[]
[null,null,null,"DỰ ÁN:",{"$f":"Bia!E11","v":"HỆ THỐNG PHẦN MỀM CHUYÊN NGÀNH XÂY DỰNG - GXD"}]
[null,null,null,"CÔNG TRÌNH:",{"$f":"UPPER(Ts!K6)","v":"CÁC PHẦN MỀM QUẢN LÝ CHI PHÍ ĐTXD CT"}]
[null,null,null,"ĐỊA ĐIỂM:",{"$f":"E44","v":"SỐ 2A/55 NGUYỄN NGỌC NẠI, THANH XUÂN, HÀ NỘI"}]
[null,null,null,"CHỦ ĐẦU TƯ:",{"$f":"E45","v":"CÔNG TY CỔ PHẦN GIÁ XÂY DỰNG"}]
[]
[null,null,null,"Giá trị dự toán:",{"$f":"TM!F51","v":47496675000},null,null,null,"đồng"]
[null,null,null,{"$f":"\"(Bằng chữ: \"&vnd(E16)&\")\"","v":"(Bằng chữ: Bốn mươi bảy tỷ bốn trăm chín mươi sáu triệu sáu trăm bảy mươi lăm nghìn đồng.)"}]
[]
[]
[null,null,null,null,null,null,null,"Hà Nội, ","ngày",{"$f":"NOW()","v":"2016-04-11T17:22:51.280"},"tháng",{"$f":"NOW()","v":"2016-04-11T17:22:51.280"},"năm",{"$f":"NOW()","v":"2016-04-11T17:22:51.280"}]
[null,null,null,null,null,null,null,null,"GIÁM ĐỐC"]
[]
[]
[]
[]
[]
[null,null,null,null,null,null,null,null,"NGUYỄN THÀNH CÔNG"]
[]
[]
["CÔNG TY CP GIÁ XÂY DỰNG",null,null,null,null,"CỘNG HOÀ XÃ HỘI CHỦ NGHĨA VIỆT NAM"]
["WWW.GIAXAYDUNG.VN",null,null,null,null,"Độc lập - Tự do - Hạnh phúc"]
[]
[]
[]
[]
[]
[]
[]
["DỰ TOÁN CHI PHÍ XÂY DỰNG"]
["Số : ……./……."]
[]
[null,null,null,"CÔNG TRÌNH: ",{"$f":"IF(Ts!K6=\"\",\"\",UPPER(Ts!K6))","v":"CÁC PHẦN MỀM QUẢN LÝ CHI PHÍ ĐTXD CT"}]
[null,null,null,"HẠNG MỤC: ",{"$f":"IF(Ts!K8=\"\",\"\",UPPER(Ts!K8))","v":"PHẦN MỀM DỰ TOÁN GXD 10"}]
[null,null,null,"ĐỊA ĐIỂM:",{"$f":"UPPER(Ts!K10)","v":"SỐ 2A/55 NGUYỄN NGỌC NẠI, THANH XUÂN, HÀ NỘI"}]
[null,null,null,"CHỦ ĐẦU TƯ:",{"$f":"UPPER(Ts!K12)","v":"CÔNG TY CỔ PHẦN GIÁ XÂY DỰNG"}]

{"sheet":"TM","index":4,"n_rows":52,"n_cols":16,"rows_kept":52,"cut":false,"hidden":false,"merged":[[49,5,49,6],[50,5,50,6]]}
[null,null,"THUYẾT MINH LẬP DỰ TOÁN"]
[null,null,{"$f":"Bia!D42&Bia!E42","v":"CÔNG TRÌNH: CÁC PHẦN MỀM QUẢN LÝ CHI PHÍ ĐTXD CT"}]
[null,null,{"$f":"Bia!D43&Bia!E43","v":"HẠNG MỤC: PHẦN MỀM DỰ TOÁN GXD 10"}]
[]
[null,"MHVB","CƠ SỞ LẬP DỰ TOÁN:"]
[null,null,"  1. Các văn bản:",null,null,null,null,null,null,null,null,null,null,null,null,"Tại cột B có thể gõ từ khóa của văn bản cần tìm để tra cứu danh mục văn bản"]
[null,null,null,"- Nghị định số 32/2015/NĐ-CP ngày 25/03/2015 của Chính phủ về quản lý chi phí đầu tư xây dựng.",null,null,null,null,null,null,null,null,null,null,null,"Tại cột A có thể căn chỉnh dòng cho vừa trang in. Gõ phím m+Enter để Merge dòng sau đó gõ phím w+Enter để wrap text."]
[null,null,null,"- Thông tư số 06/2016/TT-BXD ngày 10/3/2016 của Bộ Xây dựng hướng dẫn xác định và quản lý chi phí đầu tư xây dựng công trình."]
[]
[]
[null,null,"  2. Định mức dự toán:"]
[null,null,null,"- Định mức dự toán XDCT phần Xây dựng công bố kèm theo văn bản số 1776/2007/BXD-VP ngày 16/08/2007 của Bộ Xây dựng."]
[null,null,null,"- Định mức dự toán XDCT phần Lắp đặt công bố kèm theo văn bản số 1777/2007/BXD-VP ngày 16/08/2007 của Bộ Xây dựng."]
[null,null,null,"- Định mức dự toán XDCT sửa đổi, bổ sung."]
[null,null,null,"- Định mức dự toán XDCT sửa đổi, bổ sung."]
[]
[null,null,"  3. Đơn giá áp dụng:"]
[null,null,null,"- Đơn giá xây dựng công trình phần Xây dựng công bố kèm theo quyết định số .../QĐ-UBND ngày .../.../20.. của UBND tỉnh .."]
[null,null,null,"- Đơn giá xây dựng công trình phần Lắp đặt công bố kèm theo quyết định số .../QĐ-UBND ngày .../.../20.. của UBND tỉnh .."]
[]
[null,null,"  4. Giá vật liệu:"]
[null,null,null,"- Công bố giá vật liệu Liên Sở Xây dựng - Tài chính tỉnh…"]
[null,null,null,"- Báo giá vật liệu thị trường đối với một số loại vật liệu không có trong công bố giá"]
[null,null,null,"- Báo giá vật liệu từ một số công trình tương tự."]
[null,null,null,"- Quyết định công bố cước vận chuyển số …/QĐ-UBND ngày ../../20.. của UBND tỉnh …"]
[]
[null,null,"  5. Giá nhân công:"]
[null,null,null,"- Thông tư số 05/2016/TT-BXD ngày 10/3/2016 của Bộ Xây dựng hướng dẫn xác định đơn giá nhân công trong quản lý chi phí đầu tư xây dựng"]
[]
[null,null,"  6. Giá ca máy:"]
[null,null,null,"- Bảng giá ca máy và thiết bị thi công công bố kèm theo quyết định số .../QĐ-UBND ngày .../.../20.. của Tỉnh ...."]
[null,null,null,"- Quyết định số 1134/QĐ-BXD ngày 08/10/2015 của Bộ Xây dựng v/v công bố định mức các hao phí xác định giá ca máy và thiết bị thi công xây dựng"]
[null,null,null,"- Giá nhiên liệu theo thông cáo báo chí xăng dầu tại thời điểm lập dự toán"]
[null,null,null,"- Giá năng lượng theo Quyết định số 2256/QĐ-BCT ngày 12/3/2015 của Bộ Công thương quy định về giá bán điện"]
[]
[null,null,"  7. Văn bản hướng dẫn điều chỉnh dự toán:"]
[null,null,null,"- Văn bản số …/QĐ-UBND của UBND ... công bố hệ số điều chỉnh chi phí nhân công, chi phí máy"]
[]
[null,null,"  8. Phần mềm công cụ và cơ sở dữ liệu:"]
[null,null,null,"- Sử dụng phần mềm Dự toán GXD và cơ sở dữ liệu csv, mdb do Công ty Giá Xây Dựng sản xuất."]
[null,null,null,"- Cơ sở dữ liệu các công trình tương tự lưu trữ tại Công ty Tư vấn …"]
[]
[null,null,"  9. Hồ sơ thiết kế của công trình:"]
[null,null,null,"- Quyết định số …/QĐ-... của … phê duyệt dự án và tổng mức đầu tư"]
[null,null,null,"- Quyết định số …/QĐ-... của … phê duyệt kế hoạch đấu thầu"]
[null,null,null,"- Báo cáo khảo sát địa chất, địa hình do Công ty … thực hiện"]
[null,null,null,"- Bản vẽ thiết kế và thuyết minh biện pháp thi công do Công ty Cổ phần … lập"]
[null,null,null,"- Một số tài liệu có liên quan khác"]
[]
[null,null,null,null,"Giá trị dự toán",{"$f":"IF('Tong hop kinh phi'!H13>0,'Tong hop kinh phi'!H24,'THCP xay dung'!D22)","v":47496675297.798508}]
[null,null,null,null,"Làm tròn",{"$f":"ROUND(F50,-3)","v":47496675000},null,"đồng"]
[null,null,null,null,{"$f":"\"(Bằng chữ: \"&vnd(F51)&\")\"","v":"(Bằng chữ: Bốn mươi bảy tỷ bốn trăm chín mươi sáu triệu sáu trăm bảy mươi lăm nghìn đồng.)"}]

{"sheet":"Bao cao tham tra","index":5,"n_rows":85,"n_cols":27,"rows_kept":85,"cut":false,"hidden":true,"merged":[[61,3,65,14],[59,3,60,14],[66,3,67,14],[69,2,70,14],[24,3,24,14],[33,3,35,14],[38,3,38,14],[40,3,40,5],[47,2,47,5],[47,6,47,8],[47,9,47,11],[47,12,47,14],[42,3,42,5],[42,6,42,8],[42,9,42,11],[42,12,42,14],[46,6,46,8],[46,9,46,11],[46,12,46,14],[43,3,43,5],[43,6,43,8],[43,9,43,11],[44,12,44,14],[46,3,46,5],[43,12,43,14],[44,3,44,5],[44,6,44,8],[44,9,44,11],[3,2,5,6],[45,3,45,5],[45,6,45,8],[45,9,45,11],[45,12,45,14],[40,6,40,8],[40,9,40,11],[40,12,40,14],[28,3,29,14],[17,3,17,14],[41,3,41,5],[41,6,41,8],[41,9,41,11],[41,12,41,14],[11,3,15,14],[19,3,19,14]]}
[null,null,{"$f":"IF(S2=W2,Ts!K16,Ts!K20)","v":"Công ty Cổ phần HTT"},null,null,null,null,"CỘNG HÒA XÃ HỘI CHỦ NGHĨA VIỆT NAM",null,null,null,null,null,null,null," "]
[null,null,"           ",null,null,null,null,"              Độc lập - tự do - hạnh phúc",null,null,null,null,null,null,null,null,"Tùy chọn"," Thẩm tra ",{"$f":"VLOOKUP($R$2,$V$2:$W$4,2,0)","v":"c"},null,null," Thẩm tra ","c","thẩm tra","a",{"$f":"\"Thực hiện nhiệm vụ của \"&Ts!K12&\" giao \"&Ts!K20&\" về việc thẩm định dự toán xây dựng công trình \"&Ts!K10&\". Sau khi nghiên cứu hồ sơ \"&Ts!K20&\" có ý kiến như sau:\"","v":"Thực hiện nhiệm vụ của CÔNG TY CỔ PHẦN GIÁ XÂY DỰNG giao Phòng tư vấn xây dựng GXD về việc thẩm định dự toán xây dựng công trình SỐ 2A/55 NGUYỄN NGỌC NẠI, THANH XUÂN, HÀ NỘI. Sau khi nghiên cứu hồ sơ Phòng tư vấn xây dựng GXD có ý kiến như sau:"},"Thẩm định"]
[null,null,"Số: 137/BCTT-GXD",null,null,null,null,null,null,null,null,null,null,null,null,null,null,null,null,null,null,"Thẩm định theo nhiệm vụ ","a","thẩm định","b",{"$f":"\"Theo đề nghị của \"&Ts!K12&\" về việc thẩm định dự toán xây dựng công trình \"&Ts!K6&\" . Sau khi nghiên cứu hồ sơ \"&Ts!K20&\" có ý kiến như sau:\"","v":"Theo đề nghị của CÔNG TY CỔ PHẦN GIÁ XÂY DỰNG về việc thẩm định dự toán xây dựng công trình CÁC PHẦN MỀM QUẢN LÝ CHI PHÍ ĐTXD CT . Sau khi nghiên cứu hồ sơ Phòng tư vấn xây dựng GXD có ý kiến như sau:"},"Thẩm định"]
[null,null,{"$f":"\"V/v: \"&IF(S2=W2,\"Thẩm tra\",\"Thẩm định\")&\" dự toán công trình \"&Ts!K6","v":"V/v: Thẩm tra dự toán công trình CÁC PHẦN MỀM QUẢN LÝ CHI PHÍ ĐTXD CT"},null,null,null,null,null,null,null,null,null,null,null,"  ..., ngày ... tháng ... năm 2015",null,null,null,null,null,null,"Thẩm định theo đề nghị","b","thẩm định","c",{"$f":"\"Theo hợp đồng kinh tế số \"&Ts!K18&\" ngày \"&Ts!N18&\" ký giữa \"&Ts!K12&\" và \" &Ts!K16&\" về việc thẩm tra dự toán xây dựng công trình \"&Ts!K6&\". Sau khi nghiên cứu hồ sơ \"&Ts!K16&\" có ý kiến như sau:\"","v":"Theo hợp đồng kinh tế số 137/2014-HĐKT-GXD-HTT ngày 13 tháng 7 năm 2014 ký giữa CÔNG TY CỔ PHẦN GIÁ XÂY DỰNG và Công ty Cổ phần HTT về việc thẩm tra dự toán xây dựng công trình CÁC PHẦN MỀM QUẢN LÝ CHI PHÍ ĐTXD CT. Sau khi nghiên cứu hồ sơ Công ty Cổ phần HTT có ý kiến như sau:"}," Thẩm tra "]
[]
[]
[null,null,{"$f":"\"BÁO CÁO KẾT QUẢ \"&IF(S2=W2,\"THẨM TRA\",\"THẨM ĐỊNH\")","v":"BÁO CÁO KẾT QUẢ THẨM TRA"}]
[null,null,"DỰ TOÁN XÂY DỰNG CÔNG TRÌNH"]
[null,null,{"$f":"\"Công trình: \"&Ts!$K$6&\"\"","v":"Công trình: CÁC PHẦN MỀM QUẢN LÝ CHI PHÍ ĐTXD CT"}]
[null,null,{"$f":"\"Địa điểm: \"&Ts!$K$10&\"\"","v":"Địa điểm: SỐ 2A/55 NGUYỄN NGỌC NẠI, THANH XUÂN, HÀ NỘI"}]
[null,null,{"$f":"\"Kính gửi: \"&Ts!K12","v":"Kính gửi: CÔNG TY CỔ PHẦN GIÁ XÂY DỰNG"}]
[null,null,null,{"$f":"VLOOKUP($S$2,$Y$2:$Z$4,2,0)","v":"Theo hợp đồng kinh tế số 137/2014-HĐKT-GXD-HTT ngày 13 tháng 7 năm 2014 ký giữa CÔNG TY CỔ PHẦN GIÁ XÂY DỰNG và Công ty Cổ phần HTT về việc thẩm tra dự toán xây dựng công trình CÁC PHẦN MỀM QUẢN LÝ CHI PHÍ ĐTXD CT. Sau khi nghiên cứu hồ sơ Công ty Cổ phần HTT có ý kiến như sau:"}]
[]
[]
[]
[]
[null,"Tra cứu VB",{"$f":"\"1. Căn cứ \"&IF(S2=W2,\"thẩm tra\",\"thẩm định\")","v":"1. Căn cứ thẩm tra"},null,null,null,null,null,null,null,null,null,null,null,null,"Tại cột B có thể gõ từ khóa của văn bản cần tìm để tra cứu danh mục văn bản"]
[null,null,null,"- Nghị định số 32/2015/NĐ-CP ngày 25/3/2015 của Chính phủ về quản lý chi phí đầu tư xây dựng;",null,null,null,null,null,null,null,null,null,null,null,"Tại cột A có thể căn chỉnh dòng cho vừa trang in. Gõ phím m+Enter để Merge dòng sau đó gõ phím w+Enter để wrap text."]
[null,null,null,"- Thông tư của Bộ Xây dựng hướng dẫn lập và quản lý chi phí đầu tư xây dựng;"]
[null,null,null,"- (Các văn bản khác có liên quan của nhà nước, của các Bộ, ngành, địa phương..)"]
[null,null,"2. Giới thiệu chung về công trình  "]
[null,null,null,{"$f":"\"- Tên công trình: \"&Ts!K6","v":"- Tên công trình: CÁC PHẦN MỀM QUẢN LÝ CHI PHÍ ĐTXD CT"}]
[null,null,null,{"$f":"\"- Địa điểm: \"&Ts!K10","v":"- Địa điểm: SỐ 2A/55 NGUYỄN NGỌC NẠI, THANH XUÂN, HÀ NỘI"}]
[null,null,null,{"$f":"\"- Chủ đầu tư: \"&Ts!K12","v":"- Chủ đầu tư: CÔNG TY CỔ PHẦN GIÁ XÂY DỰNG"}]
[null,null,null,{"$f":"\"- Đơn vị tư vấn lập thiết kế, lập dự toán công trình: \"&Ts!K14","v":"- Đơn vị tư vấn lập thiết kế, lập dự toán công trình: PHÒNG NGHIÊN CỨU VÀ PHÁT TRIỂN GXD"}]
[]
[null,null,"3. Nhận xét về chất lượng hồ sơ dự toán xây dựng công trình"]
[null,null,null,"- Nhận xét phương pháp lập dự toán được lựa chọn;"]
[null,null,null,"- Nhận xét về các cơ sở để xác định các khoản mục chi phí trong trong dự toán xây dựng công trình;"]
[]
[null,null,null,"- Kết luận về đủ hay không đủ điều kiện thẩm định / thẩm tra."]
[null,null,{"$f":"\"4. Nguyên tắc \"&IF(S2=W2,\"thẩm tra\",\"thẩm định\")","v":"4. Nguyên tắc thẩm tra"}]
[null,null,null,"- Về sự phù hợp giữa khối lượng chủ yếu của dự toán với khối lượng thiết kế;"]
[null,null,null,"- Về tính đúng đắn, hợp lý của việc áp dụng, vận dụng định mức dự toán, giá xây dựng của công trình, định mức chi phí, dự toán chi phí tư vấn và dự toán các khoản mục chi phí khác trong dự toán xây dựng công trình;"]
[]
[]
[null,null,null,"- Về giá trị dự toán xây dựng công trình."]
[null,null,{"$f":"\"5. Kết quả \"&IF(S2=W2,\"thẩm tra\",\"thẩm định\")","v":"5. Kết quả thẩm tra"}]
[null,null,null,{"$f":"\"Dựa vào các căn cứ và nguyên tắc nêu trên thì giá trị dự toán xây dựng công trình sau \"&IF(S2=W2,\"thẩm tra\",\"thẩm định\")&\" như sau: \"","v":"Dựa vào các căn cứ và nguyên tắc nêu trên thì giá trị dự toán xây dựng công trình sau thẩm tra như sau: "}]
[]
[null,null,"TT","Nội dung chi phí",null,null,"Giá trị đề nghị",null,null,{"$f":"\"Giá trị \"&IF(S2=W2,\"thẩm tra\",\"thẩm định\")","v":"Giá trị thẩm tra"},null,null,"Tăng, giảm"]
[null,null,1,"Chi phí xây dựng",null,null,null,null,null,{"$f":"'Tong hop kinh phi'!H8","v":81652856728.878479},null,null,{"$f":"J42-G42","v":81652856728.878479}]
[null,null,2,"Chi phí thiết bị",null,null,null,null,null,{"$f":"'Tong hop kinh phi'!H11","v":0},null,null,{"$f":"J43-G43","v":0}]
[null,null,3,"Chi phí quản lý dự án",null,null,null,null,null,{"$f":"'Tong hop kinh phi'!H12","v":1284176746.7359977},null,null,1284176746.7359977]
[null,null,4,"Chi phí tư vấn đầu tư xây dựng",null,null,null,null,null,{"$f":"'Tong hop kinh phi'!H13","v":0},null,null,0]
[null,null,5,"Chi phí khác",null,null,null,null,null,{"$f":"'Tong hop kinh phi'!H17","v":2857850000},null,null,2857850000]
[null,null,6,"Chi phí dự phòng",null,null,null,null,null,{"$f":"'Tong hop kinh phi'!H20","v":6262702252.626194},null,null,6262702252.626194]
[null,null,"Tổng cộng",null,null,null,{"$f":"SUM(G42:I47)","v":0},null,null,{"$f":"SUM(J42:L47)","v":92057585728.240662},null,null,92057585728.240662]
[]
[null,null,"6. Nguyên nhân tăng, giảm"]
[]
[]
[]
[]
[]
[]
[]
[null,null,"7. Kết luận và kiến nghị"]
[null,null,null,"- Khối lượng trong dự toán là tương đối phù hợp với hồ sơ thiết kế;"]
[null,null,null,"- Các định mức, đơn giá, trong dự toán được lập cơ bản phù hợp với các quy định hiện hành tại thời điểm lập dự toán;"]
[]
[null,null,null,"- Giá một số vật liệu không có trong thông báo giá của Nhà nước, các loại vật tư tạm tính (TT) trong dự toán XDCT là phù hợp với giá thị trường tại thời điểm thẩm tra. Tuy nhiên giá trên chỉ mang tính chất tham khảo để Chủ đầu tư quản lý giá, không phải là giá trị thanh toán, trong quá trình thi công Chủ đầu tư căn cứ vào điều kiện thi công, các yêu cầu kỹ thuật của hồ sơ thiết kế, giá cả của từng loại vật liệu, thiết bị để xác định mức bù trừ hợp lý;"]
[]
[]
[]
[]
[null,null,null,"- Một số công tác tính thiếu khối lượng đã nêu ở trên đề nghị Chủ đầu tư yêu cầu đơn vị thiết kế sửa chữa hoàn thiện để triển khai các bước tiếp theo;"]
[]
[]
[null,null,"      Với những nội dung như báo cáo trên đây, chúng tôi đề nghị đơn vị thiết kế điều chỉnh dự toán để Chủ đầu tư có cơ sở xem xét phê duyệt phục vụ các bước tiếp theo."]
[]
[]
[null,null,{"$f":"\"NGƯỜI \"&IF(S2=W2,\"THẨM TRA\",\"THẨM ĐỊNH\")","v":"NGƯỜI THẨM TRA"},null,null,null,null,"NGƯỜI CHỦ TRÌ"]
[]
[]
[null,null,null,null,null,"            "]
[]
[null,null,null,null,null,null,"Chứng chỉ hành nghề định giá XD hạng ..., số …"]
[]
[null,null,null,"Nơi nhận",null,null,{"$f":"\"THỦ TRƯỞNG ĐƠN VỊ \"&IF(S2=W2,\"THẨM TRA\",\"THẨM ĐỊNH\")","v":"THỦ TRƯỞNG ĐƠN VỊ THẨM TRA"}]
[null,null,"   - Như trên"]
[null,null,"   - …"]
[]
[null,null,"   - Lưu …."]
[null,null,null,null,null,null,"NGUYỄN GIÁM ĐỐC"]

{"sheet":"Tong hop kinh phi","index":6,"n_rows":30,"n_cols":25,"rows_kept":30,"cut":false,"hidden":false,"merged":[]}
["BẢNG TỔNG HỢP DỰ TOÁN XÂY DỰNG CÔNG TRÌNH"]
[{"$f":"Bia!D11& Bia!E11","v":"DỰ ÁN: HỆ THỐNG PHẦN MỀM CHUYÊN NGÀNH XÂY DỰNG - GXD"}]
[{"$f":"Bia!D42&Bia!E42","v":"CÔNG TRÌNH: CÁC PHẦN MỀM QUẢN LÝ CHI PHÍ ĐTXD CT"}]
[null,null,null,null,null,null,null,"ĐVT: đồng"]
["STT","NỘI DUNG CHI PHÍ","ĐMTL","HỆ SỐ","CÁCH TÍNH","GIÁ TRỊ TRƯỚC THUẾ","THUẾ GTGT","GIÁ TRỊ SAU THUẾ","KÝ HIỆU",null,null,null,null,null,null,null,null,null,null,null,null,null,null,"CỞ SỞ PL","GHI CHÚ"]
[]
[null,"Chi phí bồi thường, hỗ trợ và tái định cư",null,null,"bảng tính",null,null,null,"GBT, TĐC"]
[1,"Chi phí xây dựng",null,null,"bảng tính",{"$f":"SUM(F9:F10)","v":74229869753.525879},{"$f":"SUM(G9:G10)","v":7422986975.3525887},{"$f":"SUM(H9:H10)","v":81652856728.878479}," GXD"]
["1.1",{"$f":"\"Hạng mục: \"&'Du toan XD'!F9","v":"Hạng mục: PHẦN MÓNG"},null,null,null,{"$f":"'THCP xay dung'!D20","v":43178795725.27137},{"$f":"'THCP xay dung'!D21","v":4317879572.5271368},{"$f":"'THCP xay dung'!D22","v":47496675297.798508}]
["1.2",{"$f":"\"Hạng mục: \"&'Du toan XD'!F14","v":"Hạng mục: PHẦN THÂN"},null,null,null,{"$f":"'THCP xay dung'!D45","v":31051074028.254517},{"$f":"'THCP xay dung'!D46","v":3105107402.8254519},{"$f":"'THCP xay dung'!D47","v":34156181431.079967}]
[2,"Chi phí thiết bị",null,null,"bảng tính",{"$f":"'THCP thiet bi'!D12","v":0},{"$f":"'THCP thiet bi'!E12","v":0},{"$f":"'THCP thiet bi'!F12","v":0}," GTB"]
[3,"Chi phí quản lý dự án",{"$f":"'QD957'!H4","v":1.73},null,{"$f":"IF(D12<>0,\"ĐMTL*(GXDtt+GTBtt)*Hệ số\",\"ĐMTL*(GXDtt+GTBtt)\")","v":"ĐMTL*(GXDtt+GTBtt)"},{"$f":"PRODUCT(C12*(GXDtt+GTBtt)/100,D12)","v":1284176746.7359977},null,{"$f":"F12","v":1284176746.7359977}," GQLDA"]
[4,"Chi phí tư vấn đầu tư xây dựng",null,null,null,{"$f":"'THCP tu van'!G10","v":0},{"$f":"'THCP tu van'!H10","v":0},{"$f":"'THCP tu van'!I10","v":0},"GTV"]
[]
[]
[]
[5,"Chi phí khác",null,null,null,{"$f":"'THCP khac'!G10","v":2598045000},{"$f":"'THCP khac'!H10","v":259805000},{"$f":"'THCP khac'!I10","v":2857850000},"GK"]
["5.1","Chi phí hạng mục chung",null,null,"bảng tính",{"$f":"'CP HMC'!F14+'CP HMC'!F27","v":2598045441.3734059},{"$f":"'CP HMC'!G14+'CP HMC'!G27","v":259804544.13734061},{"$f":"F18+G18","v":2857849985.5107465},"CHMC"]
[]
[6,"Chi phí dự phòng (GDP1 + GDP2)",null,null,"GDP1 + GDP2",{"$f":"H20/1.1","v":5693365684.2056303},{"$f":"H20-F20","v":569336568.4205637},{"$f":"'CP Du phong'!D45","v":6262702252.626194},"GDP"]
["6.1","Chi phí dự phòng cho yếu tố khối lượng phát sinh",null,null,null,{"$f":"H21/1.1","v":3899767430.7097483},{"$f":"H21-F21","v":389976743.0709753},{"$f":"CPDP_PS1","v":4289744173.7807236},"GDP1"]
["6.2","Chi phí dự phòng cho yếu tố trượt giá",null,null,null,{"$f":"H22/1.1","v":1793598253.495882},{"$f":"H22-F22","v":179359825.34958839},{"$f":"'CP Du phong'!I43","v":1972958078.8454704},"GDP2"]
[null,"Tổng cộng:",null,null,"(1)+(2)+(3)+(4)+(5)+(6)",{"$f":"F8+F11+F12+F13+F17+F20","v":83805457184.467499},{"$f":"G8+G11+G12+G13+G17+G20","v":8252128543.7731524},{"$f":"H8+H11+H12+H13+H17+H20","v":92057585728.240662}]
[null,"LÀM TRÒN (GXDCT):",null,null,null,{"$f":"ROUND(F23,-3)","v":83805457000},{"$f":"ROUND(G23,-3)","v":8252129000},{"$f":"ROUND(H23,-3)","v":92057586000}]
[]
[null,"NGƯỜI LẬP",null,null,null,"NGƯỜI CHỦ TRÌ"]
[]
[]
[]
[null,null,null,null,null,"Chứng chỉ hành nghề định giá XD hạng …, số …"]

{"sheet":"THCP tu van","index":7,"n_rows":10,"n_cols":11,"rows_kept":10,"cut":false,"hidden":true,"merged":[]}
[null,"BẢNG TỔNG HỢP CHI PHÍ TƯ VẤN"]
[null,{"$f":"Bia!D42&Bia!E42","v":"CÔNG TRÌNH: CÁC PHẦN MỀM QUẢN LÝ CHI PHÍ ĐTXD CT"}]
[null,null,null,null,null,null,null,null,"ĐVT: đồng"]
[null,"STT","NỘI DUNG CHI PHÍ","ĐMTL","HỆ SỐ","CÁCH TÍNH","GIÁ TRỊ TRƯỚC THUẾ","THUẾ GTGT","GIÁ TRỊ  SAU THUẾ","CỞ SỞ PL","GHI CHÚ"]
[]
[]
[]
[]
[null,null,"Tổng cộng:",null,null,null,{"$f":"SUM(G5:G8)","v":0},{"$f":"SUM(H5:H8)","v":0},{"$f":"SUM(I5:I8)","v":0}]
[null,null,"LÀM TRÒN (GTV)",null,null,null,{"$f":"ROUND(G9,-3)","v":0},{"$f":"ROUND(H9,-3)","v":0},{"$f":"ROUND(I9,-3)","v":0}]

{"sheet":"DT man-month","index":8,"n_rows":13,"n_cols":7,"rows_kept":13,"cut":false,"hidden":true,"merged":[]}
[null,"CHI TIẾT CÁC CHI PHÍ TƯ VẤN"]
[null,{"$f":"Bia!D42&Bia!E42","v":"CÔNG TRÌNH: CÁC PHẦN MỀM QUẢN LÝ CHI PHÍ ĐTXD CT"}]
[]
[]
[null,"STT","KHOẢN MỤC CHI PHÍ","DIỄN GIẢI","GIÁ TRỊ (ĐỒNG)","KÝ HIỆU","HỆ SỐ"]
[null,1,"Chi phí chuyên gia","Bảng tính",{"$f":"'Cp chuyen gia'!H11","v":41676601.13636364},"Ccg"]
[null,2,"Chi phí quản lý",{"$f":"G7&\"%*Ccg\"","v":"50%*Ccg"},{"$f":"E6*G7%","v":20838300.56818182},"Cql",50]
[null,3,"Chi phí khác","Bảng tính",{"$f":"'CPK TV'!E23","v":89000000},"Ck"]
[null,4,"Thu nhập chịu thuế tính trước",{"$f":"G9&\"%*(Ccg+Cql+Ck)\"","v":"6%*(Ccg+Cql+Ck)"},{"$f":"SUM(E6:E8)*G9%","v":9090894.1022727285},"TN",6]
[null,5,"Thuế giá trị gia tăng",{"$f":"G10&\"%*(Ccg+Cql+Ck+TN)\"","v":"10%*(Ccg+Cql+Ck+TN)"},{"$f":"G10%*(E6+E7+E8+E9)","v":16060579.580681819},"VAT",10]
[null,6,"Chi phí dự phòng",{"$f":"G11&\"%*(Ccg+Cql+Ck+TN+VAT)\"","v":"5%*(Ccg+Cql+Ck+TN+VAT)"},{"$f":"G11%*(SUM(E6:E10))","v":8833318.769375002},"Cdp",5]
[null,null,"Tổng cộng","Ccg+Cql+Ck+TN+VAT+Cdp",{"$f":"SUM(E6:E11)","v":185499694.15687501},"Ctv"]
[null,null,"Làm tròn:",null,{"$f":"ROUND(E12,-3)","v":185500000}]

{"sheet":"Cp chuyen gia","index":9,"n_rows":11,"n_cols":8,"rows_kept":11,"cut":false,"hidden":true,"merged":[]}
[null,{"$f":"\"CHI TIẾT CHI PHÍ CHUYÊN GIA \"","v":"CHI TIẾT CHI PHÍ CHUYÊN GIA "}]
[null,{"$f":"'DT man-month'!B2","v":"CÔNG TRÌNH: CÁC PHẦN MỀM QUẢN LÝ CHI PHÍ ĐTXD CT"}]
[]
[]
[null,"STT","MÃ CG","HỌ, TÊN CHUYÊN GIA","NHIỆM VỤ ĐƯỢC PHÂN CÔNG","THỜI GIAN THỰC HIỆN \n(NGÀY)","CHI PHÍ \nNGÀY CÔNG","THÀNH TIỀN\n(ĐỒNG)"]
[null,1,"CG1","Nguyễn Thế Anh","Chủ trì chung, hướng dẫn, đôn đốc và kiểm tra các công việc",50,{"$f":"Tienluong!K6","v":360112.04545454547},{"$f":"F6*G6","v":18005602.272727273}]
[null,2,{"$f":"Tienluong!C7","v":"CG2"},{"$f":"Tienluong!D7","v":"Vũ Minh Hoàn"},"Tổ trưởng nhóm thiết kế cơ sở",30,{"$f":"VLOOKUP(C7,Tienluong!$C$6:$K$17,9,0)","v":192345.34090909091},{"$f":"F7*G7","v":5770360.2272727275}]
[null,3,{"$f":"Tienluong!C8","v":"CG3"},{"$f":"Tienluong!D8","v":"Nguyễn Văn Toàn"},"Thuyết minh thiết kế cơ sở",30,{"$f":"VLOOKUP(C8,Tienluong!$C$6:$K$17,9,0)","v":321628.86363636365},{"$f":"F8*G8","v":9648865.9090909101}]
[null,4,{"$f":"Tienluong!C9","v":"CG4"},{"$f":"Tienluong!D9","v":"Phạm Văn Thắng"},"Thiết kế bản vẽ thiết kế cơ sở",30,{"$f":"VLOOKUP(C9,Tienluong!$C$6:$K$17,9,0)","v":275059.09090909088},{"$f":"F9*G9","v":8251772.7272727266}]
[]
[null,"TỔNG CỘNG",null,null,null,null,null,{"$f":"SUM(H6:H10)","v":41676601.13636364}]

{"sheet":"Tienluong","index":10,"n_rows":17,"n_cols":17,"rows_kept":17,"cut":false,"hidden":true,"merged":[]}
[null,"CHI TIẾT LƯƠNG CHUYÊN GIA"]
[null,{"$f":"'DT man-month'!B2","v":"CÔNG TRÌNH: CÁC PHẦN MỀM QUẢN LÝ CHI PHÍ ĐTXD CT"},null,null,null,null,null,null,null,null,null,null,null,null,"Mức lương tính lương cơ bản",1150000,"đ/tháng"]
[null,null,null,null,null,null,null,null,null,null,null,null,null,null,"Ngày công làm việc trong tháng",22,"ngày/tháng"]
[null,null,null,null,null,null,null,null,null,null,"Đơn vị: Đồng/ngày công"]
[null,"STT","MÃ CG","HỌ VÀ TÊN","CHỨC DANH DỰ KIẾN","HỆ SỐ LƯƠNG","LƯƠNG CƠ BẢN","CHI PHÍ XÃ HỘI","HỆ SỐ PHỤ CẤP","PHỤ CẤP","CHI PHÍ NGÀY CÔNG",null,null,"STT","Chi phí xã hội","Tỷ lệ","Ghi chú"]
[null,1,"CG1","Nguyễn Thế Anh","Chuyên gia",5.42,{"$f":"F6*$P$2/$P$3","v":283318.18181818182},{"$f":"G6*$P$11","v":29748.409090909092},0.9,{"$f":"I6*$P$2/$P$3","v":47045.454545454544},{"$f":"G6+H6+J6","v":360112.04545454547},null,null,1,"Kinh phí công đoàn",0]
[null,2,"CG2","Vũ Minh Hoàn","Chuyên gia",3.33,174068.18181818182,18277.159090909092,null,null,192345.34090909091,null,null,2,"Bảo hiểm xã hội",0.08]
[null,3,"CG3","Nguyễn Văn Toàn","Chuyên gia",4.9800000000000004,260318.18181818185,27333.409090909092,0.65,{"$f":"I8*$P$2/$P$3","v":33977.272727272728},321628.86363636365,null,null,3,"Bảo hiểm y tế",1.4999999999999999E-2]
[null,4,"CG4","Phạm Văn Thắng","Chuyên gia",4.4000000000000004,230000,24150,0.4,{"$f":"I9*$P$2/$P$3","v":20909.090909090908},275059.09090909088,null,null,4,"Bảo hiểm thất nghiệp",0.01]
[null,5,"CG5","Mai Chí Linh","Chuyên gia",3,156818.18181818182,16465.909090909092,0.4,{"$f":"I10*$P$2/$P$3","v":20909.090909090908},194193.18181818182]
[null,6,"CG6","Dương Minh Đức","Chuyên gia",4.4000000000000004,230000,24150,0.4,{"$f":"I11*$P$2/$P$3","v":20909.090909090908},275059.09090909088,null,null,null,"Tổng cộng",{"$f":"SUM(P6:P9)","v":0.105}]
[null,7,"CG7","Nguyễn Thanh Tùng","Chuyên gia",3.66,191318.18181818182,20088.409090909092,null,null,211406.59090909091]
[null,8,"CG8","Trần Hoàng Linh","Chuyên gia",5.42,283318.18181818182,29748.409090909092,null,null,313066.59090909094]
[null,9,"CG9","Nguyễn Thị Tuyết","Chuyên gia",3.33,174068.18181818182,18277.159090909092,null,null,192345.34090909091]
[null,10,"CG10","Trần Văn Châu","Chuyên gia",4.9800000000000004,260318.18181818185,27333.409090909092,0.4,{"$f":"I15*$P$2/$P$3","v":20909.090909090908},308560.68181818182]
[null,11,"CG11","Bùi Hương Giang","Chuyên gia",4.9800000000000004,260318.18181818185,27333.409090909092,0.6,{"$f":"I16*$P$2/$P$3","v":31363.636363636364},319015.22727272729]
[null,12,"CG12","Phan Đăng Dũng","Chuyên gia",5.08,265545.45454545453,27882.272727272724,0.6,{"$f":"I17*$P$2/$P$3","v":31363.636363636364},324791.36363636359]

{"sheet":"CPK TV","index":11,"n_rows":23,"n_cols":5,"rows_kept":23,"cut":false,"hidden":true,"merged":[]}
[null,"CHI TIẾT CHI PHÍ KHÁC"]
[null,{"$f":"'DT man-month'!B2","v":"CÔNG TRÌNH: CÁC PHẦN MỀM QUẢN LÝ CHI PHÍ ĐTXD CT"}]
[]
[]
[null,"STT","KHOẢN MỤC CHI PHÍ","DIỄN GIẢI CÁCH TÍNH","THÀNH TIỀN (ĐỒNG)"]
[null,1,"Khấu hao thiết bị văn phòng"," "]
[null,null," - Máy tính + phần mềm bản quyền","10 máy * 45.000đồng/ ca *60 ca",{"$f":"45000*10*60","v":27000000}]
[null,null," - Máy in","2 máy * 35.000đồng/ ca *20 ca",{"$f":"2*35000*20","v":1400000}]
[null,null," - Máy photocopy","50.000đồng/ca *1 máy * 20 ca",{"$f":"50000*1*20","v":1000000}]
[null,null," - Máy điều hòa nhiệt độ","40.000 đ/ca * 4 máy *30 ca",{"$f":"40000*4*30","v":4800000}]
[null,null," - Máy hủy tài liệu, UPS, bàn ghế…","30.000đồng/ca *2 máy * 30 ca",{"$f":"30000*2*30","v":1800000}]
[null,2,"Văn phòng phẩm"]
[null,null," - Giấy","20 gram * 75.000 đ/gram",{"$f":"20*75000","v":1500000}]
[null,null," - Mực in","2 hộp * 1.500.000đ/hộp",{"$f":"2*1500000","v":3000000}]
[null,null," - Văn phòng phẩm khác (bút, dụng cụ đóng tập…)","2 tháng * 1.000.000 đồng",{"$f":"2*1000000","v":2000000}]
[null,3,"Chi phí đi lại"]
[null,null,"Chi phí đi khảo sát hiện trường","tạm tính",15000000]
[null,4,"Chi phí hội họp, phản biện","4 lần * 4.000.000 đồng",{"$f":"4*4000000","v":16000000}]
[null,5,"Chi phí quản lý khác"]
[null,null,"- Điện thoại","10 người * 500.000 đồng",{"$f":"10*500000","v":5000000}]
[null,null,"- Internet","3 tháng * 500.000 đồng",{"$f":"3*500000","v":1500000}]
[null,null,"- Điện, nước văn phòng","3 tháng * 3.000.000 đồng",{"$f":"3*3000000","v":9000000}]
[null,null,"Tổng cộng",null,{"$f":"SUM(E7:E22)","v":89000000}]

{"sheet":"Tien do TV","index":12,"n_rows":11,"n_cols":103,"rows_kept":11,"cut":false,"hidden":true,"merged":[[5,9,6,9],[5,10,6,10],[5,11,6,11],[0,1,0,8],[4,1,4,8],[5,1,6,1],[5,2,6,2],[5,3,6,3],[5,4,6,4],[5,5,6,5],[5,6,6,6],[5,7,6,7],[5,8,6,8]]}
[null,"TIẾN ĐỘ THỰC HIỆN CÔNG VIỆC TƯ VẤN"]
[]
[]
[null,"Tiến độ thực hiện gói thầu tư vấn:"]
[]
[null,"STT","DANH MỤC CÔNG VIỆC","CÁN BỘ THỰC HIỆN","NGÀY BẮT ĐẦU","BẮT ĐẦU","THỜI GIAN","NGÀY KẾT THÚC","KẾT THÚC","BẮT ĐẦU THỰC TẾ","THỜI GIAN","TỶ LỆ HOÀN THÀNH",null,"NGÀY"]
[null,null,null,null,null,null,null,null,null,null,null,null,null,1,2,3,4,5,6,7,8,9,10,11,12,13,14,15,16,17,18,19,20,21,22,23,24,25,26,27,28,29,30,31,32,33,34,35,36,37,38,39,40,41,42,43,44,45,46,47,48,49,50,51,52,53,54,55,56,57,58,59,60,61,62,63,64,65,66,67,68,69,70,71,72,73,74,75,76,77,78,79,80,81,82,83,84,85,86,87,88,89,90]
[null,1,null,null,null,1,1,{"$f":"IF(I8=\"\",\"\",E8+I8-1)","v":"00:00:00"},{"$f":"IF(F8=\"\",\"\",F8+G8-1)","v":1},{"$f":"F8","v":1},1,1]
[null,null,null,null,null,null,null,null,null,0,0,1]
[null,null,null,null,null,null,null,null,null,0,0,1]
[null,null,null,null,null,null,null,null,null,0,0,1]

{"sheet":"THCP khac","index":13,"n_rows":10,"n_cols":11,"rows_kept":10,"cut":false,"hidden":true,"merged":[]}
[null,"BẢNG TỔNG HỢP CHI PHÍ KHÁC"]
[null,{"$f":"Bia!D42&Bia!E42","v":"CÔNG TRÌNH: CÁC PHẦN MỀM QUẢN LÝ CHI PHÍ ĐTXD CT"}]
[null,null,null,null,null,null,null,null,"ĐVT: đồng"]
[null,"STT","NỘI DUNG CHI PHÍ","ĐMTL","HỆ SỐ","CÁCH TÍNH","GIÁ TRỊ TRƯỚC THUẾ","THUẾ GTGT","GIÁ TRỊ  SAU THUẾ","CỞ SỞ PL","GHI CHÚ"]
[null,{"$f":"'Tong hop kinh phi'!A18","v":"5.1"},{"$f":"'Tong hop kinh phi'!B18","v":"Chi phí hạng mục chung"},{"$f":"'Tong hop kinh phi'!C18","v":0},null,{"$f":"'Tong hop kinh phi'!E18","v":"bảng tính"},{"$f":"'Tong hop kinh phi'!F18","v":2598045441.3734059},{"$f":"'Tong hop kinh phi'!G18","v":259804544.13734061},{"$f":"'Tong hop kinh phi'!H18","v":2857849985.5107465}]
[]
[]
[]
[null,null,"Tổng cộng:",null,null,null,{"$f":"SUM(G5:G8)","v":2598045441.3734059},{"$f":"SUM(H5:H8)","v":259804544.13734061},{"$f":"SUM(I5:I8)","v":2857849985.5107465}]
[null,null,"LÀM TRÒN (GK)",null,null,null,{"$f":"ROUND(G9,-3)","v":2598045000},{"$f":"ROUND(H9,-3)","v":259805000},{"$f":"ROUND(I9,-3)","v":2857850000}]

{"sheet":"CP HMC","index":14,"n_rows":27,"n_cols":15,"rows_kept":27,"cut":false,"hidden":true,"merged":[]}
[null,"TỔNG HỢP DỰ TOÁN CHI PHÍ HẠNG MỤC CHUNG"]
[null,{"$f":"'Tong hop kinh phi'!A3","v":"CÔNG TRÌNH: CÁC PHẦN MỀM QUẢN LÝ CHI PHÍ ĐTXD CT"}]
[null,"CHI PHÍ HẠNG MỤC CHUNG THI CÔNG XÂY DỰNG"]
[null,null,null,null,null,null,null,"ĐVT: đồng",null,null,"Hệ số CHMC tính trong Dự toán gói thầu thi công xây dựng: ",null,null,null,{"$f":"ROUND(IFERROR(H14/'Tong hop kinh phi'!H8,D7+D8),2)","v":0.04}]
[null,"STT","NỘI DUNG CHI PHÍ","ĐMTL","CÁCH TÍNH","CHI PHÍ TRƯỚC THUẾ","THUẾ GTGT","CHI PHÍ SAU THUẾ","KÝ HIỆU"]
[]
[null,1,"Chi phí xây dựng nhà tạm tại hiện trường để ở và điều hành thi công",{"$f":"Ts!O58","v":0.01},"ĐMTL*GXD",{"$f":"D7*GXDtt","v":742298697.53525877},{"$f":"F7*10%","v":74229869.753525883},{"$f":"F7+G7","v":816528567.28878462},"CNT"]
[null,2,"Chi phí một số công tác không xác định được khối lượng từ thiết kế",{"$f":"Ts!O57","v":2.5000000000000001E-2},"ĐMTL*GXD",{"$f":"D8*GXDtt","v":1855746743.8381472},{"$f":"F8*10%","v":185574674.38381472},{"$f":"F8+G8","v":2041321418.221962},"CKKL"]
[null,3,"Các chi phí hạng mục chung khác",null,null,{"$f":"SUM(F10:F13)","v":0},{"$f":"F9*10%","v":0},{"$f":"F9+G9","v":0},"CK"]
[null,"3.1","Chi phí di chuyển thiết bị thi công và lực lượng lao động đến công trường",null,"Lập dự toán"]
[null,"3.2","Chi phí đảm bảo an toàn giao thông phục vụ thi công",null,"Lập dự toán"]
[null,"3.3","Chi phí hoàn trả hạ tầng kỹ thuật do bị ảnh hưởng khi thi công xây dựng công trình",null,"Lập dự toán"]
[null,"…","…"]
[null,null,"Tổng cộng:",null,null,{"$f":"SUM(F7:F13)","v":2598045441.3734059},{"$f":"SUM(G7:G13)","v":259804544.13734061},{"$f":"SUM(H7:H13)","v":2857849985.5107465},"CHMCtcxd"]
[]
[null,"CHI PHÍ HẠNG MỤC CHUNG LẮP ĐẶT THIẾT BỊ"]
[null,null,null,null,null,null,null,"ĐVT: đồng",null,null,"Hệ số CHMC tính trong Dự toán gói thầu lắp đặt thiết bị: ",null,null,null,{"$f":"ROUND(IFERROR(H27/THLD_GLD,D20+D21),2)","v":0.04}]
[null,"STT","NỘI DUNG CHI PHÍ","ĐMTL","CÁCH TÍNH","CHI PHÍ TRƯỚC THUẾ","THUẾ GTGT","CHI PHÍ SAU THUẾ","KÝ HIỆU"]
[]
[null,1,"Chi phí xây dựng nhà tạm tại hiện trường để ở và điều hành thi công lắp đặt thiết bị",{"$f":"Ts!O58","v":0.01},"ĐMTL*GLD",{"$f":"D20*GLDtt","v":0},{"$f":"F20*10%","v":0},{"$f":"F20+G20","v":0},"CNT"]
[null,2,"Chi phí một số công tác không xác định được khối lượng từ thiết kế lắp đặt thiết bị",{"$f":"Ts!O57","v":2.5000000000000001E-2},"ĐMTL*GLD",{"$f":"D21*GLDtt","v":0},{"$f":"F21*10%","v":0},{"$f":"F21+G21","v":0},"CKKL"]
[null,3,"Các chi phí hạng mục chung khác",null,null,{"$f":"SUM(F23:F26)","v":0},{"$f":"F22*10%","v":0},{"$f":"F22+G22","v":0},"CK"]
[null,"3.1","Chi phí di chuyển thiết bị thi công và lực lượng lao động đến công trường",null,"Lập dự toán"]
[null,"3.2","Chi phí đảm bảo an toàn giao thông phục vụ thi công",null,"Lập dự toán"]
[null,"3.3","Chi phí hoàn trả hạ tầng kỹ thuật do bị ảnh hưởng khi thi công xây dựng công trình",null,"Lập dự toán"]
[null,"…","…"]
[null,null,"Tổng cộng:",null,null,{"$f":"SUM(F20:F26)","v":0},{"$f":"SUM(G20:G26)","v":0},{"$f":"SUM(H20:H26)","v":0},"CHMClđtb"]

{"sheet":"CP Du phong","index":15,"n_rows":150,"n_cols":9,"rows_kept":150,"cut":false,"hidden":true,"merged":[[30,0,31,0],[30,1,31,1],[37,0,38,0],[37,1,38,1],[147,3,147,4],[127,0,128,0],[127,1,128,1],[133,0,134,0],[133,1,134,1],[140,0,141,0],[140,1,141,1],[21,0,22,4],[21,5,22,5],[73,0,74,4],[73,5,74,5],[124,0,125,4],[124,5,125,5],[96,3,96,4],[76,0,77,0],[76,1,77,1],[82,0,83,0],[82,1,83,1],[89,0,90,0],[89,1,90,1],[44,3,44,4],[24,0,25,0],[24,1,25,1]]}
["BẢNG CHI PHÍ DỰ PHÒNG DỰ TOÁN XÂY DỰNG"]
[{"$f":"Bia!D42&Bia!E42","v":"CÔNG TRÌNH: CÁC PHẦN MỀM QUẢN LÝ CHI PHÍ ĐTXD CT"}]
[]
[null,"Chi phí xây dựng (GXD):",{"$f":"'Tong hop kinh phi'!H8","v":81652856728.878479}]
[null,"Chi phí thiết bị (GTB):",{"$f":"'Tong hop kinh phi'!H11","v":0}]
[null,"Chi phí quản lý dự án (GQLDA):",{"$f":"'Tong hop kinh phi'!H12","v":1284176746.7359977}]
[null,"Chi phí tư vấn đầu tư xây dựng (GTV):",{"$f":"'Tong hop kinh phi'!H13","v":0}]
[null,"Chi phí khác (GK):",{"$f":"'Tong hop kinh phi'!H17","v":2857850000}]
[null,"Tổng chi phí dự kiến thực hiện ở năm t (GtXDCT)",{"$f":"SUM(C4:C8)","v":85794883475.614471}]
[]
["I. Dự phòng cho khối lượng công việc phát sinh (Gdp1)"]
[null,null,null,"Kps =",0.05]
[null,"GDP1 =",{"$f":"$E$12*C9","v":4289744173.7807236}]
["II. Dự phòng cho yếu tố trượt giá (Gdp2)"]
[]
[]
[]
["- T: thời gian xây dựng công trình xác định theo quý, năm"]
["- t: số thứ tự thời gian phân bổ vốn theo kế hoạch xây dựng công trình (t=1÷T)"]
["- GtXDCT: giá trị dự toán xây dựng công trình trước chi phí dự phòng thực hiện trong khoảng thời gian thứ t"]
["- IXDCTbq: chỉ số giá xây dựng sử dụng tính dự phòng cho yếu tố trượt giá"]
["- DIXDCTbq: mức biến động bình quân của chỉ số giá xây dựng theo thời gian dựng công trình so với mức độ trượt giá bình quân của đơn vị thời gian (tháng, quý, năm) đã tính và được xác định trên cơ sở dự báo xu hướng biến động của các yếu tố chi phí giá cả trong khu vực và quốc tế bằng kinh nghiệm chuyên gia",null,null,null,null,0]
[]
["BẢNG 1: PHÂN BỔ VỐN ĐẦU TƯ THEO TIẾN ĐỘ THỰC HIỆN"]
["STT","Nội dung","Tiến độ thực hiện (năm)"]
[null,null,1,2,3,4,5,5]
[1,"Mức phân bổ vốn từng năm (%)",0.1,0.2,0.3,0.2,0.2]
[2,"Vốn phân bổ (tỷ đồng)",{"$f":"C27*$C$9","v":8579488347.5614471},{"$f":"D27*$C$9","v":17158976695.122894},{"$f":"E27*$C$9","v":25738465042.684341},{"$f":"F27*$C$9","v":17158976695.122894},{"$f":"G27*$C$9","v":17158976695.122894}]
[]
["BẢNG 2: CHỈ SỐ GIÁ XÂY DỰNG SỬ DỤNG TÍNH DỰ PḤÒNG CHO YẾU TỐ TRƯỢT GIÁ "]
["STT","Chỉ tiêu","Các năm tính chỉ số giá"]
[null,null,2010,2011,2012,2013,2014,5]
[1,"Chỉ số giá xây dựng (theo công bố của Sở Xây dựng hoặc cơ quan có thẩm quyền)",139,140,141,142,143]
[2,"Hệ số trượt giá (chỉ số giá năm đó chia cho chỉ số giá năm liền trước)",null,{"$f":"D33/C33","v":1.0071942446043165},{"$f":"E33/D33","v":1.0071428571428571},{"$f":"F33/E33","v":1.0070921985815602},{"$f":"G33/F33","v":1.0070422535211268}]
[3,"Chỉ số giá xây dựng sử dụng tính dự phòng cho yếu tố trượt giá IXDbq",null,null,null,null,{"$f":"ROUND(AVERAGE(D34:G34),G32-1)","v":1.0071178884624701}]
[]
["BẢNG 3: TÍNH CHI PHÍ DỰ PHÒNG CHO YẾU TỐ TRƯỢT GIÁ"]
["STT","Nội dung","Tiến độ thực hiện (năm)"]
[null,null,1,2,3,4,5]
[1,"Chi phí thực hiện dự án theo tiến độ chưa có trượt giá (tỷ đồng)",{"$f":"C28","v":8579488347.5614471},{"$f":"D28","v":17158976695.122894},{"$f":"E28","v":25738465042.684341},{"$f":"F28","v":17158976695.122894},{"$f":"G28","v":17158976695.122894}]
[3,"Chi phí thực hiện dự án theo tiến độ đã có trượt giá",{"$f":"C40*(($G$35+$F$22)^C39)","v":8640556188.6844521},{"$f":"D40*(($G$35+$F$22)^D39)","v":17404117407.778427},{"$f":"E40*(($G$35+$F$22)^E39)","v":26291996961.41209},{"$f":"F40*(($G$35+$F$22)^F39)","v":17652760308.826015},{"$f":"G40*(($G$35+$F$22)^G39)","v":17778410687.758957}]
[4,"Trượt giá từng năm",{"$f":"C41-C40","v":61067841.123004913},{"$f":"D41-D40","v":245140712.65553284},{"$f":"E41-E40","v":553531918.72774887},{"$f":"F41-F40","v":493783613.70312119},{"$f":"G41-G40","v":619433992.63606262}]
[5,"Trượt giá tích luỹ (GDP2)",{"$f":"C42","v":61067841.123004913},{"$f":"C43+D42","v":306208553.77853775},{"$f":"D43+E42","v":859740472.50628662},{"$f":"E43+F42","v":1353524086.2094078},{"$f":"F43+G42","v":1972958078.8454704},null,{"$f":"CPDP_GDP1-CPDP_PS1","v":1972958078.8454704}]
[]
[null,null,"GDP = GDP1 + GDP2 =",{"$f":"C13+G43","v":6262702252.626194}]
[null,null,"Tỷ lệ % dự phòng phí:",{"$f":"IF(ISERROR(D45/C9),\"\",D45/C9)","v":7.2996220740905199E-2}]
[null,null,{"$f":"\"(Bằng chữ: \"&vnd(D45)&\")\"","v":"(Bằng chữ: Sáu tỷ hai trăm sáu mươi hai triệu bảy trăm linh hai nghìn hai trăm năm mươi ba đồng.)"}]
["Ghi chú:"]
[" - Điều chỉnh lại công thức khi tiến độ thực hiện thi công xây dựng công trình khác đi."]
[" - Kích chuột vào các ô bôi màu để xem hướng dẫn."]
[" - Vào Thư viện diễn đàn http://giaxaydung.vn để tải chỉ số giá"]
[]
[]
[]
["BẢNG CHI PHÍ DỰ PHÒNG DỰ TOÁN GÓI THẦU THI CÔNG XÂY DỰNG"]
[{"$f":"Bia!D42&Bia!E42","v":"CÔNG TRÌNH: CÁC PHẦN MỀM QUẢN LÝ CHI PHÍ ĐTXD CT"}]
[]
[null,"Chi phí xây dựng (GXD)",{"$f":"'Tong hop kinh phi'!H8","v":81652856728.878479}]
[null,"Chi phí hạng mục chung thi công xây dựng (HMCTCXD)",{"$f":"'CP HMC'!H14","v":2857849985.5107465}]
[null,"Chi phí dự kiến thực hiện ở năm t (GtGTXD)",{"$f":"SUM(C58:C59)","v":84510706714.389221}]
[]
["I. Dự phòng cho khối lượng công việc phát sinh (Gdp1)"]
[null,null,null,"Kps =",0.05]
[null,"GDPXD1 = (GXD +HMCTCXD)* Kps = ",{"$f":"$E$63*C60","v":4225535335.7194614}]
["II. Dự phòng cho yếu tố trượt giá (GDPXD2)"]
[]
[]
[]
[]
["- T: thời gian xây dựng công trình xác định theo quý, năm"]
["- t: số thứ tự thời gian phân bổ vốn theo kế hoạch xây dựng công trình (t=1÷T)"]
["- GtGTXD: giá trị gói thầu xây dựng công trình trước chi phí dự phòng thực hiện trong khoảng thời gian thứ t"]
["- IXDCTbq: chỉ số giá xây dựng sử dụng tính dự phòng cho yếu tố trượt giá"]
["- DIXDCTbq: mức biến động bình quân của chỉ số giá xây dựng theo thời gian dựng công trình so với mức độ trượt giá bình quân của đơn vị thời gian (tháng, quý, năm) đã tính và được xác định trên cơ sở dự báo xu hướng biến động của các yếu tố chi phí giá cả trong khu vực và quốc tế bằng kinh nghiệm chuyên gia",null,null,null,null,{"$f":"F22","v":0}]
[]
["BẢNG 1: PHÂN BỔ VỐN ĐẦU TƯ THEO TIẾN ĐỘ THỰC HIỆN"]
["STT","Nội dung","Tiến độ thực hiện (năm)"]
[null,null,1,2,3,4,5]
[1,"Mức phân bổ vốn từng năm (%)",0.1,0.2,0.3,0.2,0.2]
[2,"Vốn phân bổ (tỷ đồng)",{"$f":"C79*$C$60","v":8451070671.4389229},{"$f":"D79*$C$60","v":16902141342.877846},{"$f":"E79*$C$60","v":25353212014.316765},{"$f":"F79*$C$60","v":16902141342.877846},{"$f":"G79*$C$60","v":16902141342.877846}]
[]
["BẢNG 2: CHỈ SỐ GIÁ XÂY DỰNG SỬ DỤNG TÍNH DỰ PḤÒNG CHO YẾU TỐ TRƯỢT GIÁ "]
["STT","Chỉ tiêu","Các năm tính chỉ số giá"]
[null,null,2010,2011,2012,2013,2014]
[1,"Chỉ số giá xây dựng (theo công bố của Sở Xây dựng hoặc cơ quan có thẩm quyền)",139,140,141,142,143]
[2,"Hệ số trượt giá (chỉ số giá năm đó chia cho chỉ số giá năm liền trước)",null,{"$f":"D85/C85","v":1.0071942446043165},{"$f":"E85/D85","v":1.0071428571428571},{"$f":"F85/E85","v":1.0070921985815602},{"$f":"G85/F85","v":1.0070422535211268}]
[3,"Chỉ số giá xây dựng sử dụng tính dự phòng cho yếu tố trượt giá IXDbq",null,null,null,null,{"$f":"ROUND(AVERAGE(D86:G86),G84-1)","v":1.0071178884624701}]
[]
["BẢNG 3: TÍNH CHI PHÍ DỰ PHÒNG CHO YẾU TỐ TRƯỢT GIÁ"]
["STT","Nội dung","Tiến độ thực hiện (năm)"]
[null,null,1,2,3,4,5]
[1,"Chi phí thực hiện dự án theo tiến độ chưa có trượt giá (tỷ đồng)",{"$f":"C80","v":8451070671.4389229},{"$f":"D80","v":16902141342.877846},{"$f":"E80","v":25353212014.316765},{"$f":"F80","v":16902141342.877846},{"$f":"G80","v":16902141342.877846}]
[3,"Chi phí thực hiện dự án theo tiến độ đã có trượt giá",{"$f":"C92*($G$87+$F$74)^C91","v":8511224449.8666773},{"$f":"D92*($G$87+$F$74)^D91","v":17143612792.359753},{"$f":"E92*($G$87+$F$74)^E91","v":25898458674.089314},{"$f":"F92*($G$87+$F$74)^F91","v":17388534009.52092},{"$f":"G92*($G$87+$F$74)^G91","v":17512303655.126553}]
[4,"Trượt giá từng năm",{"$f":"C93-C92","v":60153778.427754402},{"$f":"D93-D92","v":241471449.48190689},{"$f":"E93-E92","v":545246659.77254868},{"$f":"F93-F92","v":486392666.64307404},{"$f":"G93-G92","v":610162312.24870682}]
[5,"Trượt giá tích luỹ (GDP2)",{"$f":"C94","v":60153778.427754402},{"$f":"C95+D94","v":301625227.90966129},{"$f":"D95+E94","v":846871887.68220997},{"$f":"E95+F94","v":1333264554.325284},{"$f":"F95+G94","v":1943426866.5739908}]
[]
[null,null,"GDPXD = GDPXD1 + GDPXD2 =",{"$f":"C64+G95","v":6168962202.2934523}]
[null,null,"Tỷ lệ % dự phòng phí gói thầu thi công xây dựng:",{"$f":"ROUND(IF(C60=0,0,D97/C60),3)","v":7.2999999999999995E-2}]
[null,null,{"$f":"\"(Bằng chữ: \"&vnd(D97)&\")\"","v":"(Bằng chữ: Sáu tỷ một trăm sáu mươi tám triệu chín trăm sáu mươi hai nghìn hai trăm linh hai đồng.)"}]
[null,"Chi phí dự phòng cho phần chi phí xây dựng",null,{"$f":"$D$98*C58","v":5960658541.2081289}]
[null,"Chi phí dự phòng cho phần chi phí HMC",null,{"$f":"$D$98*C59","v":208623048.94228449}]
[null,"Tỷ lệ để phân bổ chi phí dự phòng phần CP HMC vào chi phí xây dựng",null,{"$f":"IF(C58<>0,D101/C58,0)","v":2.555E-3}]
[null,"Tỷ lệ để phân bổ toàn bộ chi phí dự phòng vào các đơn giá dự thầu",null,{"$f":"D98+D102","v":7.5554999999999997E-2}]
[]
[]
["BẢNG CHI PHÍ DỰ PHÒNG DỰ TOÁN GÓI THẦU THIẾT BỊ"]
[{"$f":"Bia!D87&Bia!E87","v":""}]
[]
[null,"Chi phí thiết bị (GTB)",{"$f":"'THCP thiet bi'!F13","v":0}]
[null,"Chi phí hạng mục chung lắp đặt thiết bị (HMCLDTB)",{"$f":"'CP HMC'!H27","v":0}]
[null,"Chi phí dự kiến thực hiện ở năm t (GtTB)",{"$f":"SUM(C109:C110)","v":0}]
[]
["I. Dự phòng cho khối lượng công việc phát sinh (Gdp1)"]
[null,null,null,"Kps =",0.05]
[null,"GDPTB1 = GTB * Kps = ",{"$f":"$E$114*C111","v":0}]
["II. Dự phòng cho yếu tố trượt giá (Gdp2)"]
[]
[]
[]
[]
["- T: thời gian xây dựng công trình xác định theo quý, năm"]
["- t: số thứ tự thời gian phân bổ vốn theo kế hoạch xây dựng công trình (t=1÷T)"]
["- GtTB: giá trị gói thầu mua sắm, chuyển giao, lắp đặt thiết bị trước chi phí dự phòng thực hiện trong khoảng thời gian thứ t"]
["- IXDCTbq: chỉ số giá xây dựng sử dụng tính dự phòng cho yếu tố trượt giá"]
["- DIXDCTbq: mức biến động bình quân của chỉ số giá xây dựng theo thời gian dựng công trình so với mức độ trượt giá bình quân của đơn vị thời gian (tháng, quý, năm) đã tính và được xác định trên cơ sở dự báo xu hướng biến động của các yếu tố chi phí giá cả trong khu vực và quốc tế bằng kinh nghiệm chuyên gia",null,null,null,null,{"$f":"C68","v":0}]
[]
["BẢNG 1: PHÂN BỔ VỐN ĐẦU TƯ THEO TIẾN ĐỘ THỰC HIỆN"]
["STT","Nội dung","Tiến độ thực hiện (năm)"]
[null,null,1,2,3,4,5]
[1,"Mức phân bổ vốn từng năm (%)",0.1,0.2,0.3,0.2,0.2]
[2,"Vốn phân bổ (tỷ đồng)",{"$f":"C130*$C$111","v":0},{"$f":"D130*$C$111","v":0},{"$f":"E130*$C$111","v":0},{"$f":"F130*$C$111","v":0},{"$f":"G130*$C$111","v":0}]
[]
["BẢNG 2: CHỈ SỐ GIÁ XÂY DỰNG SỬ DỤNG TÍNH DỰ PḤÒNG CHO YẾU TỐ TRƯỢT GIÁ "]
["STT","Chỉ tiêu","Các năm tính chỉ số giá"]
[null,null,2010,2011,2012,2013,2014]
[1,"Chỉ số giá xây dựng (theo công bố của Sở Xây dựng hoặc cơ quan có thẩm quyền)",139,140,141,142,143]
[2,"Hệ số trượt giá (chỉ số giá năm đó chia cho chỉ số giá năm liền trước)",null,{"$f":"D136/C136","v":1.0071942446043165},{"$f":"E136/D136","v":1.0071428571428571},{"$f":"F136/E136","v":1.0070921985815602},{"$f":"G136/F136","v":1.0070422535211268}]
[3,"Chỉ số giá xây dựng sử dụng tính dự phòng cho yếu tố trượt giá IXDbq",null,null,null,null,{"$f":"ROUND(AVERAGE(D137:G137),G135-1)","v":1.0071178884624701}]
[]
["BẢNG 3: TÍNH CHI PHÍ DỰ PHÒNG CHO YẾU TỐ TRƯỢT GIÁ"]
["STT","Nội dung","Tiến độ thực hiện (năm)"]
[null,null,1,2,3,4,5]
[1,"Chi phí thực hiện dự án theo tiến độ chưa có trượt giá (tỷ đồng)",{"$f":"C131","v":0},{"$f":"D131","v":0},{"$f":"E131","v":0},{"$f":"F131","v":0},{"$f":"G131","v":0}]
[3,"Chi phí thực hiện dự án theo tiến độ đã có trượt giá",{"$f":"C143*($G$138+$F$125)^C142","v":0},{"$f":"D143*($G$87+$F$74)^D142","v":0},{"$f":"E143*($G$87+$F$74)^E142","v":0},{"$f":"F143*($G$87+$F$74)^F142","v":0},{"$f":"G143*($G$87+$F$74)^G142","v":0}]
[4,"Trượt giá từng năm",{"$f":"C144-C143","v":0},{"$f":"D144-D143","v":0},{"$f":"E144-E143","v":0},{"$f":"F144-F143","v":0},{"$f":"G144-G143","v":0}]
[5,"Trượt giá tích luỹ (GDPTB2)",{"$f":"C145","v":0},{"$f":"C146+D145","v":0},{"$f":"D146+E145","v":0},{"$f":"E146+F145","v":0},{"$f":"F146+G145","v":0}]
[]
[null,null,"GDPTB = GDPTB1 + GDPTB2 =",{"$f":"C115+G146","v":0}]
[null,null,"Tỷ lệ % dự phòng phí gói thầu mua sắm vật tư, lắp đặt thiết bị:",{"$f":"ROUND(IF(C111=0,0,D148/C111),3)","v":0}]
[null,null,{"$f":"\"(Bằng chữ: \"&vnd(D148)&\")\"","v":"(Bằng chữ:  đồng.)"}]

{"sheet":"QD957","index":16,"n_rows":300,"n_cols":38,"rows_kept":300,"cut":false,"hidden":true,"merged":[[138,24,138,35],[16,12,16,14],[2,12,2,15],[1,12,1,15],[0,12,0,15],[118,22,119,22],[13,24,13,35],[239,22,239,32],[265,22,265,32],[269,22,271,22],[269,23,271,23],[269,24,270,32],[240,22,240,32],[244,22,246,22],[244,23,246,23],[244,24,245,32],[256,22,258,22],[256,23,258,23],[256,24,257,32],[281,22,283,22],[281,23,283,23],[281,24,282,32],[290,22,290,32],[292,22,294,22],[292,23,294,23],[292,24,293,32]]}
[null,"BẢNG TÍNH NỘI SUY CÁC ĐỊNH MỨC TỶ LỆ",null,null,null,null,null,null,null,null,null,null,{"$f":"GXDtt","v":74229869753.525879},null,null,null,"Gxdtt",null,null,null,null,null,"Bảng số 1: Định mức chi phí quản lý dự án"]
[null,"TT","LOẠI CHI PHÍ","Ga","Gb","Na","Nb","ĐMTL (%)",null,null,null,null,{"$f":"GTBtt","v":0},null,null,null,"Gtbtt"]
[null,"I","CHI PHÍ QUẢN LÝ DỰ ÁN (QĐ 957)",null,null,null,null,null,null,null,null,null,{"$f":"Ts!N33","v":0},null,null,null,"TMĐT",null,null,null,null,null,null,null,null,null,null,null,null,null,null,null,null,null,null,"Đơn vị tính: Tỷ lệ %"]
[null,1,"Chi phí quản lý dự án",{"$f":"IF(XDTT+TBTT<=Y5,Y5,OFFSET(Y5,0,J12-1))","v":100},{"$f":"OFFSET(Y5,0,K12-1)","v":50},{"$f":"IF(D4=E4,OFFSET(Y5,LCT,K12-1),OFFSET(Y5,LCT,J12-1))","v":1.5369999999999999},{"$f":"OFFSET(Y5,LCT,K12-1)","v":1.9119999999999999},{"$f":"ROUND(IF(D4=E4,OFFSET(Y5,LCT,K12-1),FORECAST(XDTT+TBTT,F4:G4,D4:E4)),3)","v":1.73},null,null,null,null,null,null,{"$f":"Ts!K25","v":1},null,"loại ct",null,null,null,null,null,"TT","Loại công trình","Chi phí xây dựng và thiết bị (chưa có thuế GTGT) (tỷ đồng)"]
[null,"II","CHI PHÍ TƯ VẤN ĐẦU TƯ XÂY DỰNG CÔNG TRÌNH (QĐ 957)",null,null,null,null,null,null,null,null,null,null,null,{"$f":"Ts!K28","v":2},null,"bước tk",null,null,null,null,null,null,null,10,20,50,100,200,500,1000,2000,5000,10000,20000,30000]
[null,{"$f":"IF(C6<>\"\",COUNTA($C$6:C6)-COUNTIF($C$6:C6,\"\"),\"\")","v":1},{"$f":"IF(O7=1,\"Chi phí lập dự án đầu tư xây dựng công trình\",\"Chi phí lập báo cáo KTKT\")","v":"Chi phí lập dự án đầu tư xây dựng công trình"},{"$f":"IF(O7=1,IF(XDTT+TBTT<=Y15,Y15,OFFSET(Y15,0,J14-1)),IF(XDTT+TBTT<=Y25,Y25,OFFSET(Y25,0,L14-1)))","v":100},{"$f":"IF(O7=1,OFFSET(Y15,0,K14-1),OFFSET(Y25,0,K14-1))","v":50},{"$f":"IF(O7=1,IF(D6=E6,OFFSET(Y15,LCT,K14-1),OFFSET(Y15,LCT,J14-1)),IF(D6=E6,OFFSET(Y25,LCT,K14-1),OFFSET(Y25,LCT,J14-1)))","v":0.314},{"$f":"IF(O7=1,OFFSET(Y15,LCT,K14-1),OFFSET(Y25,LCT,K14-1))","v":0.442},{"$f":"IF(O7=2,ROUND(IF(D6=E6,OFFSET(Y25,LCT,K16-1),FORECAST(XDTT+TBTT,F6:G6,D6:E6)),3),ROUND(IF(D6=E6,OFFSET(Y15,LCT,K14-1),FORECAST(XDTT+TBTT,F6:G6,D6:E6)),3))","v":0.38},null,null,null,null,null,null,{"$f":"Ts!K27","v":5},null,"cấp ct",null,null,null,null,null,1,"Công trình dân dụng",2.524,2.141,1.9119999999999999,1.5369999999999999,1.4359999999999999,1.254,1.026,0.79300000000000004,0.58899999999999997,0.442,0.33,0.26400000000000001]
[null,{"$f":"IF(C7<>\"\",COUNTA($C$6:C7)-COUNTIF($C$6:C7,\"\"),\"\")","v":2},{"$f":"IF(O7=1,\"Chi phí thẩm tra tính hiệu quả dự án đầu tư\",\"\")","v":"Chi phí thẩm tra tính hiệu quả dự án đầu tư"},{"$f":"IF(O7=1,IF(XDTT+TBTT<=Y140,Y140,OFFSET(Y140,0,J15-1)),0)","v":100},{"$f":"IF(O7=1,OFFSET(Y140,0,K15-1),0)","v":50},{"$f":"IF(O7=1,IF(D7=E7,OFFSET(Y140,LCT,K15-1),OFFSET(Y140,LCT,J15-1)),0)","v":4.7E-2},{"$f":"IF(O7=1,OFFSET(Y140,LCT,K15-1),0)","v":6.6000000000000003E-2},{"$f":"IF(AND(O7=1,XDTT+TBTT>=15),ROUND(IF(D7=E7,OFFSET(Y140,LCT,K15-1),FORECAST(XDTT+TBTT,F7:G7,D7:E7)),3),0)","v":5.7000000000000002E-2},null,null,null,null,null,null,{"$f":"Ts!K29","v":1},null,"loại bc",null,null,null,null,null,2,"Công trình công nghiệp",2.657,2.254,2.0129999999999999,1.617,1.512,1.32,1.08,0.93100000000000005,0.62,0.46500000000000002,0.34699999999999998,0.27800000000000002]
[null,{"$f":"IF(C8<>\"\",COUNTA($C$6:C8)-COUNTIF($C$6:C8,\"\"),\"\")","v":3},{"$f":"IF(O5=3,\"Chi phí thiết kế kỹ thuật\",IF(O5=2,\"Chi phí thiết kế bản vẽ thi công\",\"\"))","v":"Chi phí thiết kế bản vẽ thi công"},{"$f":"IF(O7=1,IF(E8=10000,E8,IF(XDTT<=Y36,Y36,OFFSET(Y36,0,J16-1))),0)","v":100},{"$f":"IF(O7=1,OFFSET(Y36,0,K16-1),0)","v":50},{"$f":"IF(O7=1,IF(E8=10000,VLOOKUP(BTK,$M$19:$O$20,3,0),VLOOKUP(BTK,$M$19:$O$20,2,0)),0)","v":1.62},{"$f":"IF(O7=1,VLOOKUP(BTK,$M$19:$O$20,3,0),0)","v":1.91},{"$f":"IF(O7=1,ROUND(IF(D8=E8,G8,FORECAST(XDTT,F8:G8,D8:E8)),3),0)","v":1.7689999999999999},null,null,null,null,null,null,null,null,null,null,null,null,null,null,3,"Công trình giao thông",2.2589999999999999,1.9159999999999999,1.7110000000000001,1.375,1.2849999999999999,1.1220000000000001,0.91800000000000004,0.79100000000000004,0.52700000000000002,0.39500000000000002,0.29499999999999998,0.23599999999999999]
[null,{"$f":"IF(C9<>\"\",COUNTA($C$6:C9)-COUNTIF($C$6:C9,\"\"),\"\")","v":""},{"$f":"IF(O5=3,\"Chi phí thiết kế bản vẽ thi công\",\"\")","v":""},null,null,null,null,{"$f":"IF(BTK=3,ROUND(IF(O4=2,H8*60%,H8*55%),3),0)","v":0},null,null,null,null,null,null,null,null,null,null,null,null,null,null,4,"Công trình nông nghiệp và phát triển nông thôn",2.391,2.0289999999999999,1.8109999999999999,1.4550000000000001,1.361,1.1879999999999999,0.97199999999999998,0.83799999999999997,0.55800000000000005,0.41899999999999998,0.313,0.25]
[null,{"$f":"IF(C10<>\"\",COUNTA($C$6:C10)-COUNTIF($C$6:C10,\"\"),\"\")","v":4},"Chi phí thẩm tra thiết kế",{"$f":"IF(E10=10000,E10,IF(XDTT<=Y152,Y152,OFFSET(Y152,0,J18-1)))","v":100},{"$f":"OFFSET(Y152,0,K18-1)","v":50},{"$f":"IF(E10=10000,OFFSET(Y152,LCT,K18-1),IF(D10=E10,G10,OFFSET(Y152,LCT,J18-1)))","v":0.106},{"$f":"OFFSET(Y152,LCT,K18-1)","v":0.13800000000000001},{"$f":"IF(D10=E10,G10,ROUND(FORECAST(XDTT,F10:G10,D10:E10),3))","v":0.122},null,null,null,null,null,null,null,null,null,null,null,null,null,null,5,"Công trình hạ tầng kỹ thuật",2.125,1.8029999999999999,1.61,1.294,1.21,1.056,0.86399999999999999,0.74399999999999999,0.496,0.372,0.27800000000000002,0.222]
[null,{"$f":"IF(C11<>\"\",COUNTA($C$6:C11)-COUNTIF($C$6:C11,\"\"),\"\")","v":5},"Chi phí thẩm tra dự toán",{"$f":"IF(E11=10000,E11,IF(XDTT<=Y163,Y163,OFFSET(Y163,0,J19-1)))","v":100},{"$f":"OFFSET(Y163,0,K19-1)","v":50},{"$f":"IF(E11=10000,OFFSET(Y163,LCT,K19-1),IF(D11=E11,G11,OFFSET(Y163,LCT,J19-1)))","v":0.104},{"$f":"OFFSET(Y163,LCT,K19-1)","v":0.13300000000000001},{"$f":"IF(D11=E11,G11,ROUND(FORECAST(XDTT,F11:G11,D11:E11),3))","v":0.11899999999999999}]
[null,{"$f":"IF(C12<>\"\",COUNTA($C$6:C12)-COUNTIF($C$6:C12,\"\"),\"\")","v":6},"Chi phí lập HSMT, đánh giá HSDT thi công xây dựng",{"$f":"IF(E12=10000,E12,IF(XDTT<=Y173,Y173,OFFSET(Y173,0,J20-1)))","v":100},{"$f":"OFFSET(Y173,0,K20-1)","v":50},{"$f":"IF(E12=10000,OFFSET(Y173,LCT,K20-1),IF(D12=E12,G12,OFFSET(Y173,LCT,J20-1)))","v":9.9000000000000005E-2},{"$f":"OFFSET(Y173,LCT,K20-1)","v":0.152},{"$f":"IF(D12=E12,G12,ROUND(FORECAST(XDTT,F12:G12,D12:E12),3))","v":0.126},null,{"$f":"IF(XDTT+TBTT>AJ5,K12,K12+1)","v":4},{"$f":"IF(XDTT+TBTT<=Y5,1,MATCH(XDTT+TBTT,Y5:AJ5,1))","v":3},null,null,null,null,null,null,null,null,null,null,null,"Bảng số 2: Định mức chi phí lập báo cáo nghiên cứu khả thi"]
[null,{"$f":"IF(C13<>\"\",COUNTA($C$6:C13)-COUNTIF($C$6:C13,\"\"),\"\")","v":7},"Chi phí lập HSMT, đánh giá HSDT mua sắm thiết bị",{"$f":"IF(E13=10000,E13,IF(TBTT<=Y183,Y183,OFFSET(Y183,0,J21-1)))","v":10},{"$f":"OFFSET(Y183,0,K21-1)","v":10},{"$f":"IF(E13=10000,OFFSET(Y183,LCT,K21-1),IF(D13=E13,G13,OFFSET(Y183,LCT,J21-1)))","v":0.28699999999999998},{"$f":"OFFSET(Y183,LCT,K21-1)","v":0.28699999999999998},{"$f":"IF(D13=E13,G13,FORECAST(TBTT,F13:G13,D13:E13))","v":0.28699999999999998},null,null,null,null,null,null,null,null,null,null,null,null,null,null,null,null,null,null,null,null,null,null,null,null,null,null,null,"Đơn vị tính: Tỷ lệ %"]
[null,{"$f":"IF(C14<>\"\",COUNTA($C$6:C14)-COUNTIF($C$6:C14,\"\"),\"\")","v":8},"Chi phí giám sát thi công xây dựng",{"$f":"IF(E14=10000,E14,IF(XDTT<=Y193,Y193,OFFSET(Y193,0,J22-1)))","v":100},{"$f":"OFFSET(Y193,0,K22-1)","v":50},{"$f":"IF(E14=10000,OFFSET(Y193,LCT,K22-1),IF(D14=E14,G14,OFFSET(Y193,LCT,J22-1)))","v":1.512},{"$f":"OFFSET(Y193,LCT,K22-1)","v":1.948},{"$f":"IF(D14=E14,G14,ROUND(FORECAST(GXDtt/(10^9),F14:G14,D14:E14),3))","v":1.7370000000000001},null,{"$f":"IF(XDTT+TBTT>AJ15,K14,K14+1)","v":4},{"$f":"IF(O7=1,IF(XDTT+TBTT<=Y15,1,MATCH(XDTT+TBTT,Y15:AJ15,1)),IF(XDTT+TBTT<=Y25,1,MATCH(XDTT+TBTT,Y25:AB25,1)))","v":3},{"$f":"IF(XDTT+TBTT>AB25,M14,M14+1)","v":4},{"$f":"IF(XDTT+TBTT<=Y25,1,MATCH(XDTT+TBTT,Y25:AK25,1))","v":4},null,null,null,null,null,null,null,null,null,"TT","Loại công trình","Chi phí xây dựng và thiết bị (chưa có thuế GTGT) trong tổng mức đầu tư được duyệt (tỷ đồng)"]
[null,{"$f":"IF(C15<>\"\",COUNTA($C$6:C15)-COUNTIF($C$6:C15,\"\"),\"\")","v":9},"Chi phí giám sát lắp đặt thiết bị",{"$f":"IF(E15=10000,E15,IF(TBTT<=Y203,Y203,OFFSET(Y203,0,J23-1)))","v":10},{"$f":"OFFSET(Y203,0,K23-1)","v":10},{"$f":"IF(E15=10000,OFFSET(Y203,LCT,K23-1),IF(D15=E15,G15,OFFSET(Y203,LCT,J23-1)))","v":0.67500000000000004},{"$f":"OFFSET(Y203,LCT,K23-1)","v":0.67500000000000004},{"$f":"IF(D15=E15,G15,ROUND(FORECAST(GTBtt/(10^9),F15:G15,D15:E15),3))","v":0.67500000000000004},null,{"$f":"IF(XDTT+TBTT>AJ140,K15,K15+1)","v":4},{"$f":"IF(XDTT+TBTT<=Y140,1,MATCH(XDTT+TBTT,Y140:AJ140,1))","v":3},null,null,null,null,null,null,null,null,null,null,null,null,null,15,20,50,100,200,500,1000,2000,5000,10000,20000,30000]
[null,{"$f":"IF(C16<>\"\",COUNTA($C$6:C16)-COUNTIF($C$6:C16,\"\"),\"\")","v":10},"Phí thẩm tra thiết kế xây dựng công trình sử dụng vốn ngân sách nhà nước do cơ quan quản lý nhà nước thực hiện toàn bộ công việc thẩm tra",{"$f":"IF(E16=10000,E16,IF(TBTT<=Y247,Y247,OFFSET(Y247,0,J24-1)))","v":15},{"$f":"OFFSET(Y247,0,K24-1)","v":50},{"$f":"IF(E16=10000,OFFSET(Y247,LCT,K24-1),IF(D16=E16,G16,OFFSET(Y247,LCT,J24-1)))","v":8.5000000000000006E-2},{"$f":"OFFSET(Y247,LCT,K24-1)","v":0.11},{"$f":"IF(D16=E16,G16,ROUND(FORECAST(XDTT,F16:G16,D16:E16),3))","v":0.127},null,{"$f":"IF(XDTT>AJ36,K16,K16+1)","v":5},{"$f":"IF(XDTT<=Y36,1,MATCH(XDTT,Y36:AJ36,1))","v":4},null,null,null,null,"Thiết kế kỹ thuật - 3 bước",null,null,null,null,null,null,1,"Công trình dân dụng",0.65500000000000003,0.53800000000000003,0.442,0.314,0.23699999999999999,0.191,0.16400000000000001,0.13900000000000001,0.111,8.8999999999999996E-2,7.0000000000000007E-2,5.7000000000000002E-2]
[null,{"$f":"IF(C17<>\"\",COUNTA($C$6:C17)-COUNTIF($C$6:C17,\"\"),\"\")","v":11},"Phí thẩm tra dự toán xây dựng công trình sử dụng vốn ngân sách nhà nước do cơ quan quản lý nhà nước thực hiện toàn bộ công việc thẩm tra",{"$f":"IF(E17=10000,E17,IF(TBTT<=Y259,Y259,OFFSET(Y259,0,J25-1)))","v":15},{"$f":"OFFSET(Y259,0,K25-1)","v":50},{"$f":"IF(E17=10000,OFFSET(Y259,LCT,K25-1),IF(D17=E17,G17,OFFSET(Y259,LCT,J25-1)))","v":8.3000000000000004E-2},{"$f":"OFFSET(Y259,LCT,K25-1)","v":0.106},{"$f":"IF(D17=E17,G17,ROUND(FORECAST(XDTT,F17:G17,D17:E17),3))","v":0.122},null,null,null,null,"Giá trị nội suy",null,null,"DD","CN","GT","TL","HT",null,null,2,"Công trình công nghiệp",0.93400000000000005,0.79400000000000004,0.63,0.46700000000000003,0.36799999999999999,0.34499999999999997,0.29899999999999999,0.24199999999999999,0.20699999999999999,0.14499999999999999,0.104,7.3999999999999996E-2]
[null,{"$f":"IF(C18<>\"\",COUNTA($C$6:C18)-COUNTIF($C$6:C18,\"\"),\"\")","v":12},"Phí thẩm tra thiết kế xây dựng công trình sử dụng vốn ngân sách nhà nước khi cơ quan quản lý nhà nước thuê tổ chức tư vấn, cá nhân cùng thẩm tra",{"$f":"IF(E18=10000,E18,IF(TBTT<=Y272,Y272,OFFSET(Y272,0,J26-1)))","v":15},{"$f":"OFFSET(Y272,0,K26-1)","v":50},{"$f":"IF(E18=10000,OFFSET(Y272,LCT,K26-1),IF(D18=E18,G18,OFFSET(Y272,LCT,J26-1)))","v":2.5499999999999998E-2},{"$f":"OFFSET(Y272,LCT,K26-1)","v":3.3000000000000002E-2},{"$f":"IF(D18=E18,G18,ROUND(FORECAST(XDTT,F18:G18,D18:E18),3))","v":3.7999999999999999E-2},null,{"$f":"IF(XDTT>AI152,K18,K18+1)","v":4},{"$f":"IF(XDTT<=Y152,1,MATCH(XDTT,Y152:AI152,1))","v":3},null,null,"Na","Nb",1,2,3,4,5,null,null,3,"Công trình giao thông",0.49199999999999999,0.44900000000000001,0.35799999999999998,0.28100000000000003,0.19400000000000001,0.15,0.13100000000000001,0.112,8.8999999999999996E-2,7.1999999999999995E-2,5.8000000000000003E-2,4.7E-2]
[null,{"$f":"IF(C19<>\"\",COUNTA($C$6:C19)-COUNTIF($C$6:C19,\"\"),\"\")","v":13},"Phí thẩm tra dự toán xây dựng công trình sử dụng vốn ngân sách nhà nước khi cơ quan quản lý nhà nước thuê tổ chức tư vấn, cá nhân cùng thẩm tra",{"$f":"IF(E19=10000,E19,IF(TBTT<=Y284,Y284,OFFSET(Y284,0,J27-1)))","v":15},{"$f":"OFFSET(Y284,0,K27-1)","v":50},{"$f":"IF(E19=10000,OFFSET(Y284,LCT,K27-1),IF(D19=E19,G19,OFFSET(Y284,LCT,J27-1)))","v":2.4899999999999999E-2},{"$f":"OFFSET(Y284,LCT,K27-1)","v":3.1800000000000002E-2},{"$f":"IF(D19=E19,G19,ROUND(FORECAST(XDTT,F19:G19,D19:E19),3))","v":3.6999999999999998E-2},null,{"$f":"IF(XDTT>AI163,K19,K19+1)","v":4},{"$f":"IF(XDTT<=Y163,1,MATCH(XDTT,Y163:AI163,1))","v":3},null,3,{"$f":"HLOOKUP(LCT,$P$18:$T$20,2)","v":1.04},{"$f":"HLOOKUP(LCT,$P$18:$T$20,3)","v":1.23},{"$f":"HLOOKUP($D$8,$Y$36:$AJ$41,CCT+1)","v":1.04},{"$f":"HLOOKUP($D$8,$Y$57:$AJ$62,CCT+1)","v":1.08},{"$f":"HLOOKUP($D$8,$Y$78:$AJ$83,CCT+1)","v":0.6},{"$f":"HLOOKUP($D$8,$Y$99:$AJ$104,CCT+1)","v":0.93},{"$f":"HLOOKUP($D$8,$Y$120:$AJ$125,CCT+1)","v":0.8},null,null,4,"Công trình nông nghiệp và PTNT",0.58899999999999997,0.53600000000000003,0.42799999999999999,0.3,0.22600000000000001,0.182,0.156,0.13400000000000001,0.107,8.5999999999999993E-2,6.9000000000000006E-2,5.6000000000000001E-2]
[null,{"$f":"IF(C20<>\"\",COUNTA($C$6:C20)-COUNTIF($C$6:C20,\"\"),\"\")","v":14},"Phí thẩm tra thiết kế xây dựng công trình sử dụng nguồn vốn khác",{"$f":"IF(E20=10000,E20,IF(TBTT<=Y295,Y295,OFFSET(Y295,0,J28-1)))","v":15},{"$f":"OFFSET(Y295,0,K28-1)","v":50},{"$f":"IF(E20=10000,OFFSET(Y295,LCT,K28-1),IF(D20=E20,G20,OFFSET(Y295,LCT,J28-1)))","v":6.6000000000000003E-2},{"$f":"OFFSET(Y295,LCT,K28-1)","v":6.6000000000000003E-2},{"$f":"IF(D20=E20,G20,ROUND(FORECAST(XDTT,F20:G20,D20:E20),3))","v":6.6000000000000003E-2},null,{"$f":"IF(XDTT>AI173,K20,K20+1)","v":4},{"$f":"IF(XDTT<=Y173,1,MATCH(XDTT,Y173:AI173,1))","v":3},null,2,{"$f":"HLOOKUP(LCT,$P$24:$T$26,2)","v":1.62},{"$f":"HLOOKUP(LCT,$P$24:$T$26,3)","v":1.91},{"$f":"HLOOKUP($E$8,$Y$36:$AJ$41,CCT+1)","v":1.23},{"$f":"HLOOKUP($E$8,$Y$57:$AJ$62,CCT+1)","v":1.17},{"$f":"HLOOKUP($E$8,$Y$78:$AJ$83,CCT+1)","v":0.66},{"$f":"HLOOKUP($E$8,$Y$99:$AJ$104,CCT+1)","v":1.1000000000000001},{"$f":"HLOOKUP($E$8,$Y$120:$AJ$125,CCT+1)","v":0.88},null,null,5,"Công trình hạ tầng kỹ thuật",0.51400000000000001,0.46700000000000003,0.374,0.29099999999999998,0.2,0.156,0.13700000000000001,0.11700000000000001,9.4E-2,7.4999999999999997E-2,0.06,4.8000000000000001E-2]
[null,"III","CHI PHÍ KHÁC (176/BTC và Thông tư 19/2011/TT-BTC)",null,null,null,null,null,null,{"$f":"IF(TBTT>AI183,K21,K21+1)","v":2},{"$f":"IF(TBTT<=Y183,1,MATCH(TBTT,Y183:AI183,1))","v":1}]
[null,1,"Lệ phí thẩm định thiết kế",null,null,null,null,null,null,{"$f":"IF(XDTT>AI193,K22,K22+1)","v":4},{"$f":"IF(XDTT<=Y193,1,MATCH(XDTT,Y193:AI193,1))","v":3},null,null,null,null,"Thiết kế BVTC - 2 bước",null,null,null,null,null,null,"Bảng số 3: Định mức chi phí lập báo cáo kinh tế - kỹ thuật"]
[null,2,"Lệ phí thẩm định dự toán",null,null,null,null,null,null,{"$f":"IF(TBTT>AI203,K23,K23+1)","v":2},{"$f":"IF(TBTT<=Y203,1,MATCH(TBTT,Y203:AI203,1))","v":1},null,null,null,null,"DD","CN","GT","TL","HT",null,null,null,null,null,null,"Đơn vị tính: Tỷ lệ %"]
[null,3,"Phí thẩm định dự án",{"$f":"IF(TMDT<=Y219,Y219,OFFSET(Y219,0,J33-1))","v":15},{"$f":"OFFSET(Y219,0,K33-1)","v":15},{"$f":"IF(D24=E24,OFFSET(Y219,1,K33-1),OFFSET(Y219,1,J33-1))","v":1.9E-2},{"$f":"OFFSET(Y219,1,K33-1)","v":1.9E-2},{"$f":"IF(D24=E24,G24,ROUND(FORECAST(TMDT,F24:G24,D24:E24),4))","v":1.9E-2},null,{"$f":"IF(XDTT>AG247,K24,K24+1)","v":3},{"$f":"IF(XDTT<=Y247,1,MATCH(XDTT,Y247:AG247,1))","v":2},null,null,null,null,1,2,3,4,5,null,null,"TT","Loại công trình","Chi phí xây dựng và thiết bị (chưa có thuế GTGT) trong dự toán của Báo cáo kinh tế - kỹ thuật được duyệt (tỷ đồng)"]
[null,4,"Chi phí kiểm toán",{"$f":"IF(TMDT<=Y212,Y212,OFFSET(Y212,0,J34-1))","v":5},{"$f":"OFFSET(Y212,0,K34-1)","v":5},{"$f":"IF(D25=E25,OFFSET(Y212,2,K34-1),OFFSET(Y212,2,J34-1))","v":0.64},{"$f":"OFFSET(Y212,2,K34-1)","v":0.64},{"$f":"IF(D25=E25,G25,ROUND(FORECAST(TMDT,F25:G25,D25:E25),3))","v":0.64},null,{"$f":"IF(XDTT>AG259,K25,K25+1)","v":3},{"$f":"IF(XDTT<=Y259,1,MATCH(XDTT,Y259:AG259,1))","v":2},null,null,null,null,{"$f":"HLOOKUP($D$8,$Y$46:$AJ$51,CCT+1)","v":1.62},{"$f":"HLOOKUP($D$8,$Y$67:$AJ$72,CCT+1)","v":1.72},{"$f":"HLOOKUP($D$8,$Y$88:$AJ$93,CCT+1)","v":0.92},{"$f":"HLOOKUP($D$8,$Y$109:$AJ$114,CCT+1)","v":1.44},{"$f":"HLOOKUP($D$8,$Y$130:$AJ$135,CCT+1)","v":1.23},null,null,null,null,1,3,7,15]
[null,5,"Chi phí thẩm tra phê duyệt, quyết toán vốn",{"$f":"IF(TMDT<=Y212,Y212,OFFSET(Y212,0,J35-1))","v":5},{"$f":"OFFSET(Y212,0,K35-1)","v":5},{"$f":"IF(D26=E26,OFFSET(Y212,1,K35-1),OFFSET(Y212,1,J35-1))","v":0.38},{"$f":"OFFSET(Y212,1,K35-1)","v":0.38},{"$f":"IF(ISERROR(M2/M3<=0.51),IF(D26=E26,G26,ROUND(FORECAST(TMDT,F26:G26,D26:E26),3)),IF(M2/M3<=0.51,IF(D26=E26,G26,ROUND(FORECAST(TMDT,F26:G26,D26:E26),3)),IF(D26=E26,G26,ROUND(FORECAST(TMDT,F26:G26,D26:E26),3))*0.7))","v":0.38},null,{"$f":"IF(XDTT>AG272,K26,K26+1)","v":3},{"$f":"IF(XDTT<=Y272,1,MATCH(XDTT,Y272:AG272,1))","v":2},null,null,null,null,{"$f":"HLOOKUP($E$8,$Y$46:$AJ$51,CCT+1)","v":1.91},{"$f":"HLOOKUP($E$8,$Y$67:$AJ$72,CCT+1)","v":1.87},{"$f":"HLOOKUP($E$8,$Y$88:$AJ$93,CCT+1)","v":1.01},{"$f":"HLOOKUP($E$8,$Y$109:$AJ$114,CCT+1)","v":1.7},{"$f":"HLOOKUP($E$8,$Y$130:$AJ$135,CCT+1)","v":1.35},null,null,1,"Công trình dân dụng",3.6,3.6,3.2,2.8]
[null,null,null,null,null,null,null,null,null,{"$f":"IF(XDTT>AG284,K27,K27+1)","v":3},{"$f":"IF(XDTT<=Y284,1,MATCH(XDTT,Y284:AG284,1))","v":2},null,null,null,null,null,null,null,null,null,null,null,2,"Công trình công nghiệp",3.7,3.7,3.3,2.9]
[null,null,null,null,null,null,null,null,null,{"$f":"IF(XDTT>AG251,K28,K28+1)","v":2},{"$f":"IF(XDTT<=Y295,1,MATCH(XDTT,Y295:AG295,1))","v":2},null,null,null,null,null,null,null,null,null,null,null,3,"Công trình giao thông",2.8,2.8,2.1,1.9]
[null,null,null,null,null,null,null,null,null,null,null,null,null,null,null,null,null,null,null,null,null,null,4,"Công trình nông nghiệp và PTNT",3.4,3.4,3,2.8]
[null,null,null,null,null,null,null,null,null,{"$f":"IF(LCT=1,\"V\",IF(LCT=2,\"I\",IF(LCT=3,\"IV\",IF(LCT=4,\"III\",\"II\"))))","v":"V"},{"$f":"IF(LCT=1,5,IF(LCT=2,1,IF(LCT=3,4,IF(LCT=4,3,2))))","v":5},null,null,null,null,null,null,null,null,null,null,null,5,"Công trình hạ tầng kỹ thuật",3.2,3.2,2.6,2.2999999999999998]
[]
[null,null,null,null,null,null,null,null,null,null,null,null,null,null,null,null,null,null,null,null,null,null,"3.3.9. Định mức chi phí thiết kế công trình dân dụng"]
[null,null,null,null,null,null,null,null,null,{"$f":"IF(TMDT>AH219,K33,K33+1)","v":2},{"$f":"IF(TMDT<=Y219,1,MATCH(TMDT,Y219:AH219,1))","v":1},null,null,null,null,null,null,null,null,null,null,null,"Bảng số 4: Định mức chi phí thiết kế kỹ thuật của công trình dân dụng có yêu cầu thiết kế 3 bước"]
[null,null,null,null,null,null,null,null,null,{"$f":"IF(TMDT>AF212,K34,K34+1)","v":2},{"$f":"IF(TMDT<=Y212,1,MATCH(TMDT,Y212:AF212,1))","v":1},null,"TMDT",{"$f":"M3/10^9","v":0},null,null,null,null,null,null,null,null,null,null,null,null,null,null,null,null,null,null,null,null,"Đơn vị tính: Tỷ lệ %"]
[null,null,null,null,null,null,null,null,null,{"$f":"IF(TMDT>AF212,K35,K35+1)","v":2},{"$f":"IF(TMDT<=Y212,1,MATCH(TMDT,Y212:AF212,1))","v":1},null,"XDTT",{"$f":"M1/10^9","v":74.229869753525875},null,null,null,null,null,null,null,null,"TT","Cấp công trình","Chi phí xây dựng (chưa có thuế GTGT) trong dự toán công trình được duyệt (tỷ đồng)"]
[null,null,null,null,null,null,null,null,null,null,null,null,"TBTT",{"$f":"M2/10^9","v":0},null,null,null,null,null,null,null,null,null,null,7,10,20,50,100,200,500,1000,2000,5000,8000,10000]
[null,null,null,null,null,null,null,null,null,null,null,1,"Thiết kế 1 bước",null,null,null,null,null,null,null,null,null,1,"Cấp đặc biệt",2.74,2.74,2.38,2,1.82,1.66,1.4,1.1299999999999999,0.97,0.75,0.57999999999999996,0.57999999999999996]
[null,null,null,null,null,null,null,null,null,null,null,2,"Thiết kế 2 bước",null,null,null,null,null,null,null,null,null,2,"Cấp I",2.48,2.48,2.17,1.82,1.64,1.51,1.27,1.03,0.89,0.68,0.53,0.53]
[null,null,null,null,null,null,null,null,null,null,null,3,"Thiết kế 3 bước",null,null,null,null,null,null,null,null,null,3,"Cấp II",2.36,2.25,1.96,1.66,1.51,1.37,1.1599999999999999,0.95,0.8,0.62,0.47,0.47]
[null,null,null,null,null,null,null,null,null,null,null,null,"Loại công trình",null,null,null,null,null,null,null,null,null,4,"Cấp III",2.12,2.0299999999999998,1.76,1.48,1.34,1.23,1.04,0.85,0.72,0.55000000000000004,0.42,0.42]
[null,null,null,null,null,null,null,null,null,null,null,null,"Bước thiết kế",null,null,null,null,null,null,null,null,null,5,"Cấp IV",1.88,1.8,1.57,1.23,1.04,0.88,0.75,0.61,0.61,0.61,0.61,0.61]
[null,null,null,null,null,null,null,null,null,null,null,null,"Cấp công trình"]
[null,null,null,null,null,null,null,null,null,null,null,1,"Báo cáo nghiên cứu khả thi đầu tư xây dựng",null,null,null,null,null,null,null,null,null,"Bảng số 5: Định mức chi phí thiết kế bản vẽ thi công của công trình dân dụng có yêu cầu thiết kế 2 bước"]
[null,null,null,null,null,null,null,null,null,null,null,2,"Báo cáo kinh tế - kỹ thuật đầu tư xây dựng",null,null,null,null,null,null,null,null,null,null,null,null,null,null,null,null,null,null,null,null,null,"Đơn vị tính: Tỷ lệ %"]
[null,null,null,null,null,null,null,null,null,null,null,null,null,null,null,null,null,null,null,null,null,null,"TT","Cấp công trình","Chi phí xây dựng (chưa có thuế GTGT) trong dự toán công trình được duyệt (tỷ đồng)"]
[null,null,null,null,null,null,null,null,null,null,null,null,null,null,null,null,null,null,null,null,null,null,null,null,7,10,20,50,100,200,500,1000,2000,5000,8000,10000]
[null,null,null,null,null,null,null,null,null,null,null,null,null,null,null,null,null,null,null,null,null,null,1,"Cấp đặc biệt",4.24,4.24,3.68,3.1,2.82,2.57,2.17,1.75,1.5,1.1599999999999999,0.9,0.9]
[null,null,null,null,null,null,null,null,null,null,null,null,null,null,null,null,null,null,null,null,null,null,2,"Cấp I",3.84,3.84,3.36,2.82,2.54,2.34,1.96,1.59,1.38,1.05,0.82,0.82]
[null,null,null,null,null,null,null,null,null,null,null,null,null,null,null,null,null,null,null,null,null,null,3,"Cấp II",3.63,3.48,3.01,2.54,2.29,2.1,1.79,1.45,1.24,0.96,0.73,0.73]
[null,null,null,null,null,null,null,null,null,null,null,null,null,null,null,null,null,null,null,null,null,null,4,"Cấp III",3.27,3.15,2.73,2.29,2.08,1.9,1.62,1.31,1.1100000000000001,0.86,0.65,0.65]
[null,null,null,null,null,null,null,null,null,null,null,null,null,null,null,null,null,null,null,null,null,null,5,"Cấp IV",2.9,2.78,2.4300000000000002,1.91,1.62,1.37,1.1599999999999999,0.95,0.95,0.95,0.95,0.95]
[]
[null,null,null,null,null,null,null,null,null,null,null,null,null,null,null,null,null,null,null,null,null,null,"3.3.10. Định mức chi phí thiết kế công trình công nghiệp"]
[null,null,null,null,null,null,null,null,null,null,null,null,null,null,null,null,null,null,null,null,null,null,"Bảng số 6: Định mức chi phí thiết kế kỹ thuật của công trình công nghiệp có yêu cầu thiết kế 3 bước"]
[null,null,null,null,null,null,null,null,null,null,null,null,null,null,null,null,null,null,null,null,null,null,null,null,null,null,null,null,null,null,null,null,null,null,"Đơn vị tính: Tỷ lệ %"]
[null,null,null,null,null,null,null,null,null,null,null,null,null,null,null,null,null,null,null,null,null,null,"TT","Cấp công trình","Chi phí xây dựng (chưa có thuế GTGT) trong dự toán công trình được duyệt (tỷ đồng)"]
[null,null,null,null,null,null,null,null,null,null,null,null,null,null,null,null,null,null,null,null,null,null,null,null,7,10,20,50,100,200,500,1000,2000,5000,8000,10000]
[null,null,null,null,null,null,null,null,null,null,null,null,null,null,null,null,null,null,null,null,null,null,1,"Cấp đặc biệt",2.79,2.79,2.58,2.21,2.0099999999999998,1.82,1.66,1.45,1.23,0.95,0.73,0.73]
[null,null,null,null,null,null,null,null,null,null,null,null,null,null,null,null,null,null,null,null,null,null,2,"Cấp I",2.33,2.33,2.15,1.83,1.67,1.51,1.38,1.21,1.03,0.79,0.61,0.61]
[null,null,null,null,null,null,null,null,null,null,null,null,null,null,null,null,null,null,null,null,null,null,3,"Cấp II",1.99,1.94,1.79,1.53,1.39,1.26,1.1499999999999999,1.01,0.86,0.66,0.51,0.51]
[null,null,null,null,null,null,null,null,null,null,null,null,null,null,null,null,null,null,null,null,null,null,4,"Cấp III",1.73,1.69,1.56,1.32,1.2,1.1000000000000001,1.01,0.9,0.77,0.59,0.46,0.46]
[null,null,null,null,null,null,null,null,null,null,null,null,null,null,null,null,null,null,null,null,null,null,5,"Cấp IV",1.54,1.5,1.39,1.17,1.08,0.92,0.78,0.67,0.67,0.67,0.67,0.67]
[]
[null,null,null,null,null,null,null,null,null,null,null,null,null,null,null,null,null,null,null,null,null,null,"Bảng số 7: Định mức chi phí thiết kế bản vẽ thi công của công trình công nghiệp có yêu cầu thiết kế 2 bước"]
[null,null,null,null,null,null,null,null,null,null,null,null,null,null,null,null,null,null,null,null,null,null,null,null,null,null,null,null,null,null,null,null,null,null,"Đơn vị tính: Tỷ lệ %"]
[null,null,null,null,null,null,null,null,null,null,null,null,null,null,null,null,null,null,null,null,null,null,"TT","Cấp công trình","Chi phí xây dựng (chưa có thuế GTGT) trong dự toán công trình được duyệt (tỷ đồng)"]
[null,null,null,null,null,null,null,null,null,null,null,null,null,null,null,null,null,null,null,null,null,null,null,null,7,10,20,50,100,200,500,1000,2000,5000,8000,10000]
[null,null,null,null,null,null,null,null,null,null,null,null,null,null,null,null,null,null,null,null,null,null,1,"Cấp đặc biệt",4.67,4.67,4.12,3.53,3.21,2.91,2.65,2.3199999999999998,1.96,1.52,1.1599999999999999,1.1599999999999999]
[null,null,null,null,null,null,null,null,null,null,null,null,null,null,null,null,null,null,null,null,null,null,2,"Cấp I",3.73,3.73,3.44,2.92,2.67,2.41,2.2000000000000002,1.93,1.64,1.26,0.97,0.97]
[null,null,null,null,null,null,null,null,null,null,null,null,null,null,null,null,null,null,null,null,null,null,3,"Cấp II",3.07,2.99,2.76,2.35,2.15,1.94,1.77,1.55,1.32,1.02,0.78,0.78]
[null,null,null,null,null,null,null,null,null,null,null,null,null,null,null,null,null,null,null,null,null,null,4,"Cấp III",2.76,2.69,2.4900000000000002,2.11,1.92,1.75,1.61,1.44,1.22,0.94,0.72,0.72]
[null,null,null,null,null,null,null,null,null,null,null,null,null,null,null,null,null,null,null,null,null,null,5,"Cấp IV",2.4500000000000002,2.39,2.21,1.87,1.72,1.46,1.24,1.06,1.06,1.06,1.06,1.06]
[]
[null,null,null,null,null,null,null,null,null,null,null,null,null,null,null,null,null,null,null,null,null,null,"3.3.11. Định mức chi phí thiết kế công trình giao thông"]
[null,null,null,null,null,null,null,null,null,null,null,null,null,null,null,null,null,null,null,null,null,null,"Bảng số 8: Định mức chi phí thiết kế kỹ thuật của công trình giao thông có yêu cầu thiết kế 3 bước"]
[null,null,null,null,null,null,null,null,null,null,null,null,null,null,null,null,null,null,null,null,null,null,null,null,null,null,null,null,null,null,null,null,null,null,"Đơn vị tính: Tỷ lệ %"]
[null,null,null,null,null,null,null,null,null,null,null,null,null,null,null,null,null,null,null,null,null,null,"TT","Cấp công trình","Chi phí xây dựng (chưa có thuế GTGT) trong dự toán công trình được duyệt (tỷ đồng)"]
[null,null,null,null,null,null,null,null,null,null,null,null,null,null,null,null,null,null,null,null,null,null,null,null,7,10,20,50,100,200,500,1000,2000,5000,8000,10000]
[null,null,null,null,null,null,null,null,null,null,null,null,null,null,null,null,null,null,null,null,null,null,1,"Cấp đặc biệt",1.81,1.81,1.67,1.46,1.26,1145,1.06,0.91,0.76,0.57999999999999996,0.44,0.44]
[null,null,null,null,null,null,null,null,null,null,null,null,null,null,null,null,null,null,null,null,null,null,2,"Cấp I",1.1100000000000001,1.1100000000000001,1.05,0.87,0.81,0.73,0.67,0.56999999999999995,0.48,0.37,0.28000000000000003,0.28000000000000003]
[null,null,null,null,null,null,null,null,null,null,null,null,null,null,null,null,null,null,null,null,null,null,3,"Cấp II",1.04,1.01,0.94,0.8,0.73,0.67,0.61,0.52,0.44,0.34,0.26,0.26]
[null,null,null,null,null,null,null,null,null,null,null,null,null,null,null,null,null,null,null,null,null,null,4,"Cấp III",0.95,0.92,0.85,0.73,0.67,0.61,0.5,0.42,0.24,0.28000000000000003,0.21,0.21]
[null,null,null,null,null,null,null,null,null,null,null,null,null,null,null,null,null,null,null,null,null,null,5,"Cấp IV",0.85,0.83,0.76,0.66,0.6,0.51,0.43,0.37,0.31,0.24,0.24,0.24]
[]
[null,null,null,null,null,null,null,null,null,null,null,null,null,null,null,null,null,null,null,null,null,null,"Bảng số 9: Định mức chi phí thiết kế bản vẽ thi công của công trình giao thông có yêu cầu thiết kế 2 bước"]
[null,null,null,null,null,null,null,null,null,null,null,null,null,null,null,null,null,null,null,null,null,null,null,null,null,null,null,null,null,null,null,null,null,null,"Đơn vị tính: Tỷ lệ %"]
[null,null,null,null,null,null,null,null,null,null,null,null,null,null,null,null,null,null,null,null,null,null,"TT","Cấp công trình","Chi phí xây dựng (chưa có thuế GTGT) trong dự toán công trình được duyệt (tỷ đồng)"]
[null,null,null,null,null,null,null,null,null,null,null,null,null,null,null,null,null,null,null,null,null,null,null,null,7,10,20,50,100,200,500,1000,2000,5000,8000,10000]
[null,null,null,null,null,null,null,null,null,null,null,null,null,null,null,null,null,null,null,null,null,null,1,"Cấp đặc biệt",2.8,2.8,2.58,2.21,2.0099999999999998,1.82,1.66,1.45,1.23,0.95,0.73,0.73]
[null,null,null,null,null,null,null,null,null,null,null,null,null,null,null,null,null,null,null,null,null,null,2,"Cấp I",2.72,2.72,2.15,1.83,1.67,1.51,1.38,1.21,1.03,0.79,0.61,0.61]
[null,null,null,null,null,null,null,null,null,null,null,null,null,null,null,null,null,null,null,null,null,null,3,"Cấp II",1.61,1.56,1.45,1.23,1.1200000000000001,1.03,0.93,0.79,0.67,0.52,0.4,0.4]
[null,null,null,null,null,null,null,null,null,null,null,null,null,null,null,null,null,null,null,null,null,null,4,"Cấp III",1.46,1.42,1.31,1.1299999999999999,1.03,0.92,0.77,0.65,0.55000000000000004,0.42,0.32,0.32]
[null,null,null,null,null,null,null,null,null,null,null,null,null,null,null,null,null,null,null,null,null,null,5,"Cấp IV",1.31,1.28,1.18,1.01,0.92,0.78,0.66,0.56999999999999995,0.48,0.37,0.37,0.37]
[]
[null,null,null,null,null,null,null,null,null,null,null,null,null,null,null,null,null,null,null,null,null,null,"3.3.12. Định mức chi phí thiết kế Công trình nông nghiệp và PTNT"]
[null,null,null,null,null,null,null,null,null,null,null,null,null,null,null,null,null,null,null,null,null,null,"Bảng số 10: Định mức chi phí thiết kế kỹ thuật của Công trình nông nghiệp và PTNT có yêu cầu thiết kế 3 bước"]
[null,null,null,null,null,null,null,null,null,null,null,null,null,null,null,null,null,null,null,null,null,null,null,null,null,null,null,null,null,null,null,null,null,null,"Đơn vị tính: Tỷ lệ %"]
[null,null,null,null,null,null,null,null,null,null,null,null,null,null,null,null,null,null,null,null,null,null,"TT","Cấp công trình","Chi phí xây dựng (chưa có thuế GTGT) trong dự toán công trình được duyệt (tỷ đồng)"]
[null,null,null,null,null,null,null,null,null,null,null,null,null,null,null,null,null,null,null,null,null,null,null,null,7,10,20,50,100,200,500,1000,2000,5000,8000,10000]
[null,null,null,null,null,null,null,null,null,null,null,null,null,null,null,null,null,null,null,null,null,null,1,"Cấp đặc biệt",2.59,2.59,2.25,1.91,1.72,1.57,1.34,1.1299999999999999,0.96,0.74,0.56999999999999995,0.56999999999999995]
[null,null,null,null,null,null,null,null,null,null,null,null,null,null,null,null,null,null,null,null,null,null,2,"Cấp I",2.35,2.35,2.0499999999999998,1.73,1.55,1.43,1.21,1.02,0.87,0.67,0.51,0.51]
[null,null,null,null,null,null,null,null,null,null,null,null,null,null,null,null,null,null,null,null,null,null,3,"Cấp II",2.2200000000000002,2.13,1.86,1.57,1.42,1.31,1.06,0.91,0.76,0.57999999999999996,0.45,0.45]
[null,null,null,null,null,null,null,null,null,null,null,null,null,null,null,null,null,null,null,null,null,null,4,"Cấp III",2.0099999999999998,1.93,1.67,1.4,1.27,1.08,0.92,0.78,0.67,0.51,0.4,0.4]
[null,null,null,null,null,null,null,null,null,null,null,null,null,null,null,null,null,null,null,null,null,null,5,"Cấp IV",1.77,1.7,1.49,1.1000000000000001,0.93,0.8,0.67,0.57999999999999996,0.49,0.38,0.38,0.38]
[]
[null,null,null,null,null,null,null,null,null,null,null,null,null,null,null,null,null,null,null,null,null,null,"Bảng số 11: Định mức chi phí thiết kế bản vẽ thi công của Công trình nông nghiệp và PTNT có yêu cầu thiết kế 2 bước"]
[null,null,null,null,null,null,null,null,null,null,null,null,null,null,null,null,null,null,null,null,null,null,null,null,null,null,null,null,null,null,null,null,null,null,"Đơn vị tính: Tỷ lệ %"]
[null,null,null,null,null,null,null,null,null,null,null,null,null,null,null,null,null,null,null,null,null,null,"TT","Cấp công trình","Chi phí xây dựng (chưa có thuế GTGT) trong dự toán công trình được duyệt (tỷ đồng)"]
[null,null,null,null,null,null,null,null,null,null,null,null,null,null,null,null,null,null,null,null,null,null,null,null,7,10,20,50,100,200,500,1000,2000,5000,8000,10000]
[null,null,null,null,null,null,null,null,null,null,null,null,null,null,null,null,null,null,null,null,null,null,1,"Cấp đặc biệt",4.01,4.01,3.48,2.96,2.66,2.4300000000000002,2.0699999999999998,1.75,1.48,1.1399999999999999,0.88,0.88]
[null,null,null,null,null,null,null,null,null,null,null,null,null,null,null,null,null,null,null,null,null,null,2,"Cấp I",3.64,3.64,3.17,2.68,2.4,2.21,1.87,1.58,1.34,1.03,0.79,0.79]
[null,null,null,null,null,null,null,null,null,null,null,null,null,null,null,null,null,null,null,null,null,null,3,"Cấp II",3.42,3.29,2.87,2.41,2.19,2.0099999999999998,1.62,1.38,1.17,0.9,0.51,0.51]
[null,null,null,null,null,null,null,null,null,null,null,null,null,null,null,null,null,null,null,null,null,null,4,"Cấp III",3.11,2.98,2.58,2.16,1.96,1.67,1.42,1.21,1.03,0.79,0.46,0.46]
[null,null,null,null,null,null,null,null,null,null,null,null,null,null,null,null,null,null,null,null,null,null,5,"Cấp IV",2.74,2.63,2.31,1.7,1.44,1.23,1.04,0.89,0.75,0.57999999999999996,0.57999999999999996,0.57999999999999996]
[]
[null,null,null,null,null,null,null,null,null,null,null,null,null,null,null,null,null,null,null,null,null,null,"3.3.13. Định mức chi phí thiết kế công trình hạ tầng kỹ thuật"]
[null,null,null,null,null,null,null,null,null,null,null,null,null,null,null,null,null,null,null,null,null,null,"Bảng số 12: Định mức chi phí thiết kế kỹ thuật của công trình hạ tầng kỹ thuật có yêu cầu thiết kế 3 bước"]
[null,null,null,null,null,null,null,null,null,null,null,null,null,null,null,null,null,null,null,null,null,null,null,null,null,null,null,null,null,null,null,null,null,null,"Đơn vị tính: Tỷ lệ %"]
[null,null,null,null,null,null,null,null,null,null,null,null,null,null,null,null,null,null,null,null,null,null,"TT","Cấp công trình","Chi phí xây dựng (chưa có thuế GTGT) trong dự toán công trình được duyệt (tỷ đồng)"]
[null,null,null,null,null,null,null,null,null,null,null,null,null,null,null,null,null,null,null,null,null,null,null,null,7,10,20,50,100,200,500,1000,2000,5000,8000,10000]
[null,null,null,null,null,null,null,null,null,null,null,null,null,null,null,null,null,null,null,null,null,null,1,"Cấp đặc biệt",1.95,1.95,1.69,1.42,1.29,1.18,0.99,0.84,0.72,0.55000000000000004,0.42,0.42]
[null,null,null,null,null,null,null,null,null,null,null,null,null,null,null,null,null,null,null,null,null,null,2,"Cấp I",1.77,1.77,1.54,1.31,1.17,1.07,0.85,0.72,0.61,0.47,0.31,0.31]
[null,null,null,null,null,null,null,null,null,null,null,null,null,null,null,null,null,null,null,null,null,null,3,"Cấp II",1.68,1.61,1.41,1.18,1.06,0.98,0.78,0.67,0.56999999999999995,0.44,0.28999999999999998,0.28999999999999998]
[null,null,null,null,null,null,null,null,null,null,null,null,null,null,null,null,null,null,null,null,null,null,4,"Cấp III",1.5,1.44,1.26,1.05,0.96,0.84,0.76,0.64,0.55000000000000004,0.42,0.27,0.27]
[null,null,null,null,null,null,null,null,null,null,null,null,null,null,null,null,null,null,null,null,null,null,5,"Cấp IV",1.34,1.28,1.1100000000000001,0.88,0.8,0.6,0.57999999999999996,0.5,0.42,0.32,0.32,0.32]
[]
[null,null,null,null,null,null,null,null,null,null,null,null,null,null,null,null,null,null,null,null,null,null,"Bảng số 13: Định mức chi phí thiết kế bản vẽ thi công của công trình hạ tầng kỹ thuật có yêu cầu thiết kế 2 bước"]
[null,null,null,null,null,null,null,null,null,null,null,null,null,null,null,null,null,null,null,null,null,null,null,null,null,null,null,null,null,null,null,null,null,null,"Đơn vị tính: Tỷ lệ %"]
[null,null,null,null,null,null,null,null,null,null,null,null,null,null,null,null,null,null,null,null,null,null,"TT","Cấp công trình","Chi phí xây dựng (chưa có thuế GTGT) trong dự toán công trình được duyệt (tỷ đồng)"]
[null,null,null,null,null,null,null,null,null,null,null,null,null,null,null,null,null,null,null,null,null,null,null,null,7,10,20,50,100,200,500,1000,2000,5000,8000,10000]
[null,null,null,null,null,null,null,null,null,null,null,null,null,null,null,null,null,null,null,null,null,null,1,"Cấp đặc biệt",3.02,3.02,2.61,2.2000000000000002,1.99,1.82,1.53,1.3,1.1100000000000001,0.85,0.65,0.65]
[null,null,null,null,null,null,null,null,null,null,null,null,null,null,null,null,null,null,null,null,null,null,2,"Cấp I",2.74,2.74,2.38,2.0299999999999998,1.81,1.65,1.31,1.1100000000000001,0.94,0.72,0.56000000000000005,0.56000000000000005]
[null,null,null,null,null,null,null,null,null,null,null,null,null,null,null,null,null,null,null,null,null,null,3,"Cấp II",2.58,2.48,2.15,1.81,1.64,1.51,1.21,1.02,0.87,0.67,0.51,0.51]
[null,null,null,null,null,null,null,null,null,null,null,null,null,null,null,null,null,null,null,null,null,null,4,"Cấp III",2.3199999999999998,2.23,1.94,1.62,1.48,1.29,1.17,0.99,0.84,0.64,0.41,0.41]
[null,null,null,null,null,null,null,null,null,null,null,null,null,null,null,null,null,null,null,null,null,null,5,"Cấp IV",2.0699999999999998,1.98,1.72,1.35,1.23,0.92,0.89,0.76,0.64,0.49,0.49,0.49]
[]
[null,null,null,null,null,null,null,null,null,null,null,null,null,null,null,null,null,null,null,null,null,null,"Bảng số 14: Định mức chi phí thẩm tra tính hiệu quả và tính khả thi của dự án đầu tư"]
[null,null,null,null,null,null,null,null,null,null,null,null,null,null,null,null,null,null,null,null,null,null,null,null,null,null,null,null,null,null,null,null,null,null,null,"Đơn vị tính: Tỷ lệ %"]
[null,null,null,null,null,null,null,null,null,null,null,null,null,null,null,null,null,null,null,null,null,null,"TT","Loại công trình","Chi phí xây dựng và thiết bị (chưa có thuế GTGT) trong tổng mức đầu tư được duyệt (tỷ đồng)"]
[null,null,null,null,null,null,null,null,null,null,null,null,null,null,null,null,null,null,null,null,null,null,null,null,15,20,50,100,200,500,1000,2000,5000,10000,20000,30000]
[null,null,null,null,null,null,null,null,null,null,null,null,null,null,null,null,null,null,null,null,null,null,1,"Công trình dân dụng",9.8000000000000004E-2,8.1000000000000003E-2,6.6000000000000003E-2,4.7E-2,3.5000000000000003E-2,2.3E-2,0.02,1.7000000000000001E-2,1.4E-2,0.01,8.0000000000000002E-3,6.0000000000000001E-3]
[null,null,null,null,null,null,null,null,null,null,null,null,null,null,null,null,null,null,null,null,null,null,2,"Công trình công nghiệp",0.14000000000000001,0.11899999999999999,9.5000000000000001E-2,7.0000000000000007E-2,5.5E-2,4.1000000000000002E-2,3.5999999999999997E-2,2.9000000000000001E-2,2.5000000000000001E-2,1.4999999999999999E-2,0.01,7.0000000000000001E-3]
[null,null,null,null,null,null,null,null,null,null,null,null,null,null,null,null,null,null,null,null,null,null,3,"Công trình giao thông",7.3999999999999996E-2,6.7000000000000004E-2,5.3999999999999999E-2,4.2000000000000003E-2,2.9000000000000001E-2,1.7999999999999999E-2,1.6E-2,1.2999999999999999E-2,1.0999999999999999E-2,7.0000000000000001E-3,5.0000000000000001E-3,4.0000000000000001E-3]
[null,null,null,null,null,null,null,null,null,null,null,null,null,null,null,null,null,null,null,null,null,null,4,"Công trình nông nghiệp và PTNT",8.7999999999999995E-2,0.08,6.4000000000000001E-2,4.4999999999999998E-2,3.4000000000000002E-2,2.1999999999999999E-2,1.9E-2,1.6E-2,1.2999999999999999E-2,8.9999999999999993E-3,7.0000000000000001E-3,5.0000000000000001E-3]
[null,null,null,null,null,null,null,null,null,null,null,null,null,null,null,null,null,null,null,null,null,null,5,"Công trình hạ tầng kỹ thuật",7.6999999999999999E-2,7.0000000000000007E-2,5.6000000000000001E-2,4.3999999999999997E-2,0.03,1.9E-2,1.7000000000000001E-2,1.4E-2,1.2E-2,8.0000000000000002E-3,6.0000000000000001E-3,4.0000000000000001E-3]
[]
[null,null,null,null,null,null,null,null,null,null,null,null,null,null,null,null,null,null,null,null,null,null,"Bảng số 15: Định mức chi phí thẩm tra thiết kế kỹ thuật đối với công trình có yêu cầu thiết kế 3 bước; thẩm tra thiết kế bản vẽ thi công"]
[null,null,null,null,null,null,null,null,null,null,null,null,null,null,null,null,null,null,null,null,null,null,"đối với công trình có yêu cầu thiết kế 1 bước và 2 bước"]
[null,null,null,null,null,null,null,null,null,null,null,null,null,null,null,null,null,null,null,null,null,null,null,null,null,null,null,null,null,null,null,null,null,"Đơn vị tính: Tỷ lệ %"]
[null,null,null,null,null,null,null,null,null,null,null,null,null,null,null,null,null,null,null,null,null,null,"TT","Loại công trình","Chi phí xây dựng (chưa có thuế GTGT)"]
[null,null,null,null,null,null,null,null,null,null,null,null,null,null,null,null,null,null,null,null,null,null,null,null,"(tỷ đồng)"]
[null,null,null,null,null,null,null,null,null,null,null,null,null,null,null,null,null,null,null,null,null,null,null,null,10,20,50,100,200,500,1000,2000,5000,8000,10000]
[null,null,null,null,null,null,null,null,null,null,null,null,null,null,null,null,null,null,null,null,null,null,1,"Công trình dân dụng",0.20599999999999999,0.17899999999999999,0.13800000000000001,0.106,8.1000000000000003E-2,6.3E-2,5.0999999999999997E-2,3.5999999999999997E-2,2.8000000000000001E-2,2.4E-2,2.4E-2]
[null,null,null,null,null,null,null,null,null,null,null,null,null,null,null,null,null,null,null,null,null,null,2,"Công trình công nghiệp",0.23799999999999999,0.20599999999999999,0.158,0.121,9.4E-2,7.2999999999999995E-2,5.5E-2,4.3999999999999997E-2,3.3000000000000002E-2,2.8000000000000001E-2,2.8000000000000001E-2]
[null,null,null,null,null,null,null,null,null,null,null,null,null,null,null,null,null,null,null,null,null,null,3,"Công trình giao thông",0.13600000000000001,0.11799999999999999,0.09,6.9000000000000006E-2,5.3999999999999999E-2,4.1000000000000002E-2,3.1E-2,2.5999999999999999E-2,0.02,1.7000000000000001E-2,1.7000000000000001E-2]
[null,null,null,null,null,null,null,null,null,null,null,null,null,null,null,null,null,null,null,null,null,null,4,"Công trình nông nghiệp và PTNT",0.151,0.13,0.1,7.5999999999999998E-2,0.06,4.5999999999999999E-2,3.5000000000000003E-2,2.9000000000000001E-2,2.1000000000000001E-2,1.7999999999999999E-2,1.7999999999999999E-2]
[null,null,null,null,null,null,null,null,null,null,null,null,null,null,null,null,null,null,null,null,null,null,5,"Công trình hạ tầng kỹ thuật",0.158,0.13800000000000001,0.106,8.1000000000000003E-2,6.3E-2,4.9000000000000002E-2,3.7999999999999999E-2,3.3000000000000002E-2,2.4E-2,2.1000000000000001E-2,2.1000000000000001E-2]
[]
[null,null,null,null,null,null,null,null,null,null,null,null,null,null,null,null,null,null,null,null,null,null,"Bảng số 16: Định mức chi phí thẩm tra dự toán công trình"]
[null,null,null,null,null,null,null,null,null,null,null,null,null,null,null,null,null,null,null,null,null,null,null,null,null,null,null,null,null,null,null,null,null,"Đơn vị tính: Tỷ lệ %"]
[null,null,null,null,null,null,null,null,null,null,null,null,null,null,null,null,null,null,null,null,null,null,"TT","Loại công trình","Chi phí xây dựng (chưa có thuế GTGT)"]
[null,null,null,null,null,null,null,null,null,null,null,null,null,null,null,null,null,null,null,null,null,null,null,null," (tỷ đồng)"]
[null,null,null,null,null,null,null,null,null,null,null,null,null,null,null,null,null,null,null,null,null,null,null,null,10,20,50,100,200,500,1000,2000,5000,8000,10000]
[null,null,null,null,null,null,null,null,null,null,null,null,null,null,null,null,null,null,null,null,null,null,1,"Công trình dân dụng",0.2,0.17499999999999999,0.13300000000000001,0.104,7.8E-2,5.8000000000000003E-2,4.8000000000000001E-2,3.5000000000000003E-2,2.5999999999999999E-2,2.3E-2,2.3E-2]
[null,null,null,null,null,null,null,null,null,null,null,null,null,null,null,null,null,null,null,null,null,null,2,"Công trình công nghiệp",0.23100000000000001,0.2,0.151,0.11799999999999999,0.09,6.9000000000000006E-2,5.0999999999999997E-2,4.1000000000000002E-2,2.9000000000000001E-2,2.5000000000000001E-2,2.5000000000000001E-2]
[null,null,null,null,null,null,null,null,null,null,null,null,null,null,null,null,null,null,null,null,null,null,3,"Công trình giao thông",0.13300000000000001,0.114,8.5000000000000006E-2,6.8000000000000005E-2,5.0999999999999997E-2,3.9E-2,0.03,2.5000000000000001E-2,1.7999999999999999E-2,1.4999999999999999E-2,1.4999999999999999E-2]
[null,null,null,null,null,null,null,null,null,null,null,null,null,null,null,null,null,null,null,null,null,null,4,"Công trình nông nghiệp và PTNT",0.14599999999999999,0.126,9.5000000000000001E-2,7.4999999999999997E-2,5.8000000000000003E-2,4.3999999999999997E-2,3.3000000000000002E-2,2.8000000000000001E-2,0.02,1.7000000000000001E-2,1.7000000000000001E-2]
[null,null,null,null,null,null,null,null,null,null,null,null,null,null,null,null,null,null,null,null,null,null,5,"Công trình hạ tầng kỹ thuật",0.153,0.13300000000000001,0.10299999999999999,7.8E-2,5.8999999999999997E-2,4.5999999999999999E-2,3.5999999999999997E-2,0.03,2.1000000000000001E-2,1.7999999999999999E-2,1.7999999999999999E-2]
[]
[null,null,null,null,null,null,null,null,null,null,null,null,null,null,null,null,null,null,null,null,null,null,"Bảng số 17: Định mức chi phí lập hồ sơ mời thầu, đánh giá hồ sơ dự thầu thi công xây dựng"]
[null,null,null,null,null,null,null,null,null,null,null,null,null,null,null,null,null,null,null,null,null,null,null,null,null,null,null,null,null,null,null,null,null,"Đơn vị tính: Tỷ lệ %"]
[null,null,null,null,null,null,null,null,null,null,null,null,null,null,null,null,null,null,null,null,null,null,"TT","Loại công trình","Chi phí xây dựng (chưa có thuế GTGT) trong dự toán gói thầu được duyệt (tỷ đồng)"]
[null,null,null,null,null,null,null,null,null,null,null,null,null,null,null,null,null,null,null,null,null,null,null,null,10,20,50,100,200,500,1000,2000,5000,8000,10000]
[null,null,null,null,null,null,null,null,null,null,null,null,null,null,null,null,null,null,null,null,null,null,1,"Công trình dân dụng",0.33700000000000002,0.27,0.152,9.9000000000000005E-2,5.8999999999999997E-2,4.2999999999999997E-2,0.03,2.5999999999999999E-2,2.1999999999999999E-2,1.9E-2,1.9E-2]
[null,null,null,null,null,null,null,null,null,null,null,null,null,null,null,null,null,null,null,null,null,null,2,"Công trình công nghiệp",0.439,0.30299999999999999,0.16900000000000001,0.115,7.3999999999999996E-2,5.2999999999999999E-2,0.04,3.4000000000000002E-2,2.7E-2,2.3E-2,2.3E-2]
[null,null,null,null,null,null,null,null,null,null,null,null,null,null,null,null,null,null,null,null,null,null,3,"Công trình giao thông",0.27,0.185,0.11799999999999999,7.0000000000000007E-2,4.4999999999999998E-2,3.5000000000000003E-2,2.1999999999999999E-2,1.9E-2,1.6E-2,1.4E-2,1.4E-2]
[null,null,null,null,null,null,null,null,null,null,null,null,null,null,null,null,null,null,null,null,null,null,4,"Công trình nông nghiệp và PTNT",0.28199999999999997,0.23599999999999999,0.13,7.3999999999999996E-2,4.7E-2,3.6999999999999998E-2,2.4E-2,2.1000000000000001E-2,1.7999999999999999E-2,1.6E-2,1.6E-2]
[null,null,null,null,null,null,null,null,null,null,null,null,null,null,null,null,null,null,null,null,null,null,5,"Công trình hạ tầng kỹ thuật",0.30299999999999999,0.254,0.13500000000000001,8.3000000000000004E-2,4.9000000000000002E-2,0.04,2.5999999999999999E-2,2.1999999999999999E-2,1.9E-2,1.7000000000000001E-2,1.7000000000000001E-2]
[]
[null,null,null,null,null,null,null,null,null,null,null,null,null,null,null,null,null,null,null,null,null,null,"Bảng số 18: Định mức chi phí lập hồ sơ mời thầu, đánh giá hồ sơ dự thầu mua sắm thiết bị"]
[null,null,null,null,null,null,null,null,null,null,null,null,null,null,null,null,null,null,null,null,null,null,null,null,null,null,null,null,null,null,null,null,null,"Đơn vị tính: Tỷ lệ %"]
[null,null,null,null,null,null,null,null,null,null,null,null,null,null,null,null,null,null,null,null,null,null,"TT","Loại công trình","Chi phí thiết bị (chưa có thuế GTGT) trong dự toán gói thầu được duyệt (tỷ đồng)"]
[null,null,null,null,null,null,null,null,null,null,null,null,null,null,null,null,null,null,null,null,null,null,null,null,10,20,50,100,200,500,1000,2000,5000,8000,10000]
[null,null,null,null,null,null,null,null,null,null,null,null,null,null,null,null,null,null,null,null,null,null,1,"Công trình dân dụng",0.28699999999999998,0.27,0.14199999999999999,8.8999999999999996E-2,7.9000000000000001E-2,6.6000000000000003E-2,4.4999999999999998E-2,3.5000000000000003E-2,2.7E-2,2.3E-2,2.3E-2]
[null,null,null,null,null,null,null,null,null,null,null,null,null,null,null,null,null,null,null,null,null,null,2,"Công trình công nghiệp",0.439,0.39500000000000002,0.224,0.14099999999999999,0.122,0.1,6.8000000000000005E-2,5.3999999999999999E-2,4.1000000000000002E-2,3.5999999999999997E-2,3.5999999999999997E-2]
[null,null,null,null,null,null,null,null,null,null,null,null,null,null,null,null,null,null,null,null,null,null,3,"Công trình giao thông",0.20399999999999999,0.17899999999999999,0.10299999999999999,6.6000000000000003E-2,5.8000000000000003E-2,4.5999999999999999E-2,3.2000000000000001E-2,2.5999999999999999E-2,2.1000000000000001E-2,1.9E-2,1.9E-2]
[null,null,null,null,null,null,null,null,null,null,null,null,null,null,null,null,null,null,null,null,null,null,4,"Công trình nông nghiệp và PTNT",0.219,0.191,0.11,7.0000000000000007E-2,6.0999999999999999E-2,4.9000000000000002E-2,0.04,0.03,2.4E-2,0.02,0.02]
[null,null,null,null,null,null,null,null,null,null,null,null,null,null,null,null,null,null,null,null,null,null,5,"Công trình hạ tầng kỹ thuật",0.23599999999999999,0.20300000000000001,0.122,7.9000000000000001E-2,6.8000000000000005E-2,5.6000000000000001E-2,4.3999999999999997E-2,3.4000000000000002E-2,2.5999999999999999E-2,2.1999999999999999E-2,2.1999999999999999E-2]
[]
[null,null,null,null,null,null,null,null,null,null,null,null,null,null,null,null,null,null,null,null,null,null,"Bảng số 19: Định mức chi phí giám sát thi công xây dựng"]
[null,null,null,null,null,null,null,null,null,null,null,null,null,null,null,null,null,null,null,null,null,null,null,null,null,null,null,null,null,null,null,null,null,"Đơn vị tính: Tỷ lệ %"]
[null,null,null,null,null,null,null,null,null,null,null,null,null,null,null,null,null,null,null,null,null,null,"TT","Loại công trình","Chi phí xây dựng (chưa có thuế GTGT) trong dự toán gói thầu được duyệt (tỷ đồng)"]
[null,null,null,null,null,null,null,null,null,null,null,null,null,null,null,null,null,null,null,null,null,null,null,null,10,20,50,100,200,500,1000,2000,5000,8000,10000]
[null,null,null,null,null,null,null,null,null,null,null,null,null,null,null,null,null,null,null,null,null,null,1,"Công trình dân dụng",2.6280000000000001,2.282,1.948,1.512,1.2669999999999999,0.97399999999999998,0.65300000000000002,0.58899999999999997,0.52900000000000003,0.46,0.46]
[null,null,null,null,null,null,null,null,null,null,null,null,null,null,null,null,null,null,null,null,null,null,2,"Công trình công nghiệp",2.806,2.5099999999999998,2.0470000000000002,1.7,1.3140000000000001,1.0660000000000001,0.67400000000000004,0.60699999999999998,0.54600000000000004,0.47399999999999998,0.47399999999999998]
[null,null,null,null,null,null,null,null,null,null,null,null,null,null,null,null,null,null,null,null,null,null,3,"Công trình giao thông",2.5619999999999998,2.16,1.885,1.405,1.0429999999999999,0.82199999999999995,0.59899999999999998,0.53900000000000003,0.48499999999999999,0.42199999999999999,0.42199999999999999]
[null,null,null,null,null,null,null,null,null,null,null,null,null,null,null,null,null,null,null,null,null,null,4,"Công trình nông nghiệp và PTNT",2.0790000000000002,1.8340000000000001,1.66,1.266,0.97399999999999998,0.77900000000000003,0.51800000000000002,0.46600000000000003,0.41899999999999998,0.36399999999999999,0.36399999999999999]
[null,null,null,null,null,null,null,null,null,null,null,null,null,null,null,null,null,null,null,null,null,null,5,"Công trình hạ tầng kỹ thuật",2.0529999999999999,1.8049999999999999,1.5880000000000001,1.198,0.93600000000000005,0.748,0.47799999999999998,0.43099999999999999,0.38800000000000001,0.33700000000000002,0.33700000000000002]
[]
[null,null,null,null,null,null,null,null,null,null,null,null,null,null,null,null,null,null,null,null,null,null,"Bảng số 20: Định mức chi phí giám sát lắp đặt thiết bị"]
[null,null,null,null,null,null,null,null,null,null,null,null,null,null,null,null,null,null,null,null,null,null,null,null,null,null,null,null,null,null,null,null,null,"Đơn vị tính: Tỷ lệ %"]
[null,null,null,null,null,null,null,null,null,null,null,null,null,null,null,null,null,null,null,null,null,null,"TT","Loại công trình","Chi phí thiết bị (chưa có thuế GTGT) trong dự toán gói thầu được duyệt (tỷ đồng)"]
[null,null,null,null,null,null,null,null,null,null,null,null,null,null,null,null,null,null,null,null,null,null,null,null,10,20,50,100,200,500,1000,2000,5000,8000,10000]
[null,null,null,null,null,null,null,null,null,null,null,null,null,null,null,null,null,null,null,null,null,null,1,"Công trình dân dụng",0.67500000000000004,0.57199999999999995,0.47699999999999998,0.315,0.25,0.214,0.14399999999999999,0.13,0.11700000000000001,0.10199999999999999,0.10199999999999999]
[null,null,null,null,null,null,null,null,null,null,null,null,null,null,null,null,null,null,null,null,null,null,2,"Công trình công nghiệp",0.91800000000000004,0.80400000000000005,0.76700000000000002,0.64900000000000002,0.40200000000000002,0.34599999999999997,0.29199999999999998,0.26200000000000001,0.23499999999999999,0.20399999999999999,0.20399999999999999]
[null,null,null,null,null,null,null,null,null,null,null,null,null,null,null,null,null,null,null,null,null,null,3,"Công trình giao thông",0.54200000000000004,0.46400000000000002,0.38900000000000001,0.25600000000000001,0.214,0.17799999999999999,0.12,0.108,9.7000000000000003E-2,8.4000000000000005E-2,8.4000000000000005E-2]
[null,null,null,null,null,null,null,null,null,null,null,null,null,null,null,null,null,null,null,null,null,null,4,"Công trình nông nghiệp và PTNT",0.57399999999999995,0.46800000000000003,0.41599999999999998,0.27500000000000002,0.22600000000000001,0.19,0.13,0.11700000000000001,0.105,9.0999999999999998E-2,9.0999999999999998E-2]
[null,null,null,null,null,null,null,null,null,null,null,null,null,null,null,null,null,null,null,null,null,null,5,"Công trình hạ tầng kỹ thuật",0.64300000000000002,0.55200000000000005,0.46,0.307,0.246,0.214,0.14199999999999999,0.127,0.114,9.9000000000000005E-2,9.9000000000000005E-2]
[]
[null,null,null,null,null,null,null,null,null,null,null,null,null,null,null,null,null,null,null,null,null,null,null,"Chi phí kiểm toán, thẩm tra phê duyệt quyết toán (Thông tư 19/2011/QĐ-BTC)"]
[null,null,null,null,null,null,null,null,null,null,null,null,null,null,null,null,null,null,null,null,null,null,null,"Loại chi phí","Tổng mức đầu tư (tỷ đồng)"]
[null,null,null,null,null,null,null,null,null,null,null,null,null,null,null,null,null,null,null,null,null,null,null,null,5,10,50,100,500,1000,10000,20000]
[null,null,null,null,null,null,null,null,null,null,null,null,null,null,null,null,null,null,null,null,null,null,null,"Chi phí thẩm tra, phê duyệt quyết toán vốn",0.38,0.26,0.19,0.15,0.09,0.06,3.2000000000000001E-2,0]
[null,null,null,null,null,null,null,null,null,null,null,null,null,null,null,null,null,null,null,null,null,null,null,"Chi phí kiểm toán",0.64,0.43,0.3,0.23,0.13,8.5999999999999993E-2,4.5999999999999999E-2,0]
[]
[]
[null,null,null,null,null,null,null,null,null,null,null,null,null,null,null,null,null,null,null,null,null,null,null,"BIỂU MỨC THU PHÍ THẨM ĐỊNH DỰ ÁN ĐẦU TƯ XÂY DỰNG"]
[null,null,null,null,null,null,null,null,null,null,null,null,null,null,null,null,null,null,null,null,null,null,null,"(theo Thông tư số 176/2011/TT-BTC ngày 6/12/2011 của Bộ Tài chính)"]
[null,null,null,null,null,null,null,null,null,null,null,null,null,null,null,null,null,null,null,null,null,null,null,"Tổng mức đầu tư DA (tỷ đ)",15,25,50,100,200,500,1000,2000,5000,10000]
[null,null,null,null,null,null,null,null,null,null,null,null,null,null,null,null,null,null,null,null,null,null,null,"Tỷ lệ %",1.9E-2,1.7000000000000001E-2,1.4999999999999999E-2,1.2500000000000001E-2,0.01,7.4999999999999997E-3,4.7000000000000002E-3,2.5000000000000001E-3,2E-3,1E-3]
[]
[]
[null,null,null,null,null,null,null,null,null,null,null,null,null,null,null,null,null,null,null,null,null,null,null,"Bảng số 8: Định mức chi phí lập đồ án quy hoạch chi tiết Thông tư số 17/2010/TT-BXD"]
[null,null,null,null,null,null,null,null,null,null,null,null,null,null,null,null,null,null,null,null,null,null,null,"Quy mô (ha)",5,10,20,30,50,75,100,200,300,500,750,1000,2000]
[null,null,null,null,null,null,null,null,null,null,null,null,null,null,null,null,null,null,null,null,null,null,null,"Định mức chi phí (triệu đồng/ha)",44.25,32.450000000000003,26.55,20.65,14.75,11.8,10.33,6.2,5.46,3.69,2.95,2.5099999999999998,2.12]
[]
[null,null,null,null,null,null,null,null,null,null,null,null,null,null,null,null,null,null,null,null,null,null,null,"Quy mô quy hoạch của dự án:",5,"ha",null,null,null,null,null,null,null,"Gt","Ga","Gb","ka","kb"]
[null,null,null,null,null,null,null,null,null,null,null,null,null,null,null,null,null,null,null,null,null,null,null,"Chi phí QHĐT",{"$f":"IF(AH228<=5,Y225,IF(AH228>2000,AK225,FORECAST(AH228,AK228:AL228,AI228:AJ228)))*10^6*AH228","v":221250000},null,null,null,null,null,null,null,null,{"$f":"Y227","v":5},{"$f":"IF($AH$228<=5,Y225,OFFSET($Y224,0,MATCH($AH$228,$Y$224:$AK$224,1)-1))","v":44.25},{"$f":"IF($AH$228<=5,$Y$224,IF(AH228>2000,$AK$224,OFFSET($Y$224,0,MATCH($AH$228,$Y$224:$AK$224,1))))","v":5},{"$f":"IF($AH$228<=5,$Y$225,OFFSET($Y$225,0,MATCH($AH$228,$Y$224:$AK$224,1)-1))","v":44.25},{"$f":"IF($AH$228<=5,$Y$225,IF($AH$228>$AK$224,$AK$225,OFFSET($Y$225,0,MATCH($AH$228,$Y$224:$AK$224,1))))","v":44.25}]
[null,null,null,null,null,null,null,null,null,null,null,null,null,null,null,null,null,null,null,null,null,null,null,"Định mức LNVQH",{"$f":"IF($AH$229<=200,$Y235,IF($AH$229>10000,$AK235,FORECAST($AH$229,$AK229:$AL229,$AI$229:$AJ$229)))","v":7.8583333333333343},null,null,null,null,null,null,null,null,{"$f":"QHĐT/10^6","v":221.25},{"$f":"IF($AH$229<=200,$Y$235,OFFSET($Y$234,0,MATCH($AH$229,$Y$234:$AG$234,1)-1))","v":200},{"$f":"IF($AH$229<=200,$Y$234,IF($AH$229>10000,$AF$234,OFFSET($Y$234,0,MATCH($AH$229,$Y$234:$AE$234,1))))","v":500},{"$f":"IF($AH$229<=200,$Y235,OFFSET($Y235,0,MATCH($AH$229,$Y$234:$AE$234,1)-1))","v":8},{"$f":"IF($AH$229<=200,$Y235,IF($AH$229>10000,$AE235,OFFSET($Y235,0,MATCH($AH$229,$Y$234:$AE$234,1))))","v":6}]
[null,null,null,null,null,null,null,null,null,null,null,null,null,null,null,null,null,null,null,null,null,null,null,"Định mức thẩm định ĐAQH",{"$f":"IF($AH$229<=200,$Y236,IF($AH$229>10000,$AK236,FORECAST($AH$229,$AK230:$AL230,$AI$229:$AJ$229)))","v":6.8937499999999998},null,null,null,null,null,null,null,null,null,null,null,{"$f":"IF($AH$229<=200,$Y236,OFFSET($Y236,0,MATCH($AH$229,$Y$234:$AE$234,1)-1))","v":7},{"$f":"IF($AH$229<=200,$Y236,IF($AH$229>10000,$AE236,OFFSET($Y236,0,MATCH($AH$229,$Y$234:$AE$234,1))))","v":5.5}]
[null,null,null,null,null,null,null,null,null,null,null,null,null,null,null,null,null,null,null,null,null,null,null,"Định mức QL NV lập ĐAQH",{"$f":"IF($AH$229<=200,$Y237,IF($AH$229>10000,$AK237,FORECAST($AH$229,$AK231:$AL231,$AI$229:$AJ$229)))","v":5.9291666666666671},null,null,null,null,null,null,null,null,null,null,null,{"$f":"IF($AH$229<=200,$Y237,OFFSET($Y237,0,MATCH($AH$229,$Y$234:$AE$234,1)-1))","v":6},{"$f":"IF($AH$229<=200,$Y237,IF($AH$229>10000,$AE237,OFFSET($Y237,0,MATCH($AH$229,$Y$234:$AE$234,1))))","v":5}]
[]
[null,null,null,null,null,null,null,null,null,null,null,null,null,null,null,null,null,null,null,null,null,null,null,"Bảng số 9: Định mức chi phí cho một số công việc xác định theo tỷ lệ phần trăm của chi phí lập đồ án quy hoạch"]
[null,null,null,null,null,null,null,null,null,null,null,null,null,null,null,null,null,null,null,null,null,null,"TT","Chi phí lập đồ án quy hoạch (triệu đồng)",200,500,700,1000,2000,5000,7000,10000]
[null,null,null,null,null,null,null,null,null,null,null,null,null,null,null,null,null,null,null,null,null,null,1,"Lập nhiệm vụ quy hoạch (tỷ lệ%)",8,6,5,4.5,3,2,1.8,1.6]
[null,null,null,null,null,null,null,null,null,null,null,null,null,null,null,null,null,null,null,null,null,null,2,"Thẩm định đồ án quy hoạch (tỷ lệ%)",7,5.5,4.5,4,3,2,1.8,1.6]
[null,null,null,null,null,null,null,null,null,null,null,null,null,null,null,null,null,null,null,null,null,null,3,"Quản lý nghiệp vụ lập đồ án quy hoạch (tỷ lệ%)",6,5,4.5,4,3,2,1.8,1.6]
[]
[]
[null,null,null,null,null,null,null,null,null,null,null,null,null,null,null,null,null,null,null,null,null,null,"Thông tư số 75/2014/TT-BTC ngày 12/6/2014 của Bộ tài chính quy định mức thu, chế độ thu, nộp, quản lý và sử dụng phí thẩm tra thiết kế công trình xây dựng"]
[null,null,null,null,null,null,null,null,null,null,null,null,null,null,null,null,null,null,null,null,null,null,"Phụ lục số 1: Phí thẩm tra thiết kế xây dựng công trình sử dụng vốn ngân sách nhà nước do cơ quan quản lý nhà nước thực hiện toàn bộ công việc thẩm tra"]
[]
[null,null,null,null,null,null,null,null,null,null,null,null,null,null,null,null,null,null,null,null,null,null,"1. Chi phí thẩm tra thiết kế"]
[null,null,null,null,null,null,null,null,null,null,null,null,null,null,null,null,null,null,null,null,null,null,null,null,null,null,null,null,null,null,null,"Đơn vị tính: Tỷ lệ %"]
[null,null,null,null,null,null,null,null,null,null,null,null,null,null,null,null,null,null,null,null,null,null,"TT","Loại công trình","Chi phí xây dựng (chưa có thuế GTGT) trong dự toán công trình hoặc dự toán gói thầu được duyệt (tỷ đồng)"]
[]
[null,null,null,null,null,null,null,null,null,null,null,null,null,null,null,null,null,null,null,null,null,null,null,null,15,50,100,200,500,1000,2000,5000,8000]
[null,null,null,null,null,null,null,null,null,null,null,null,null,null,null,null,null,null,null,null,null,null,1,"Công trình dân dụng",0.16500000000000001,0.11,8.5000000000000006E-2,6.5000000000000002E-2,0.05,4.1000000000000002E-2,2.9000000000000001E-2,2.1999999999999999E-2,1.9E-2]
[null,null,null,null,null,null,null,null,null,null,null,null,null,null,null,null,null,null,null,null,null,null,2,"Công trình công nghiệp",0.19,0.126,9.7000000000000003E-2,7.4999999999999997E-2,5.8000000000000003E-2,4.3999999999999997E-2,3.5000000000000003E-2,2.5999999999999999E-2,2.1999999999999999E-2]
[null,null,null,null,null,null,null,null,null,null,null,null,null,null,null,null,null,null,null,null,null,null,3,"Công trình giao thông",0.109,7.1999999999999995E-2,5.5E-2,4.2999999999999997E-2,3.3000000000000002E-2,2.5000000000000001E-2,2.1000000000000001E-2,1.6E-2,1.4E-2]
[null,null,null,null,null,null,null,null,null,null,null,null,null,null,null,null,null,null,null,null,null,null,4,"Công trình nông nghiệp và phát triển nông thôn",0.121,0.08,6.0999999999999999E-2,4.8000000000000001E-2,3.6999999999999998E-2,2.8000000000000001E-2,2.3E-2,1.7000000000000001E-2,1.4999999999999999E-2]
[null,null,null,null,null,null,null,null,null,null,null,null,null,null,null,null,null,null,null,null,null,null,5,"Công trình hạ tầng kỹ thuật",0.126,8.5000000000000006E-2,6.5000000000000002E-2,0.05,3.9E-2,0.03,2.5999999999999999E-2,1.9E-2,1.7000000000000001E-2]
[]
[]
[null,null,null,null,null,null,null,null,null,null,null,null,null,null,null,null,null,null,null,null,null,null,"2. Chi phí thẩm tra dự toán"]
[null,null,null,null,null,null,null,null,null,null,null,null,null,null,null,null,null,null,null,null,null,null,null,null,null,null,null,null,null,null,null,"Đơn vị tính: Tỷ lệ %"]
[null,null,null,null,null,null,null,null,null,null,null,null,null,null,null,null,null,null,null,null,null,null,"TT","Loại công trình","Chi phí xây dựng (chưa có thuế GTGT) trong dự toán công trình hoặc dự toán gói thầu được duyệt (tỷ đồng)"]
[]
[null,null,null,null,null,null,null,null,null,null,null,null,null,null,null,null,null,null,null,null,null,null,null,null,15,50,100,200,500,1000,2000,5000,8000]
[null,null,null,null,null,null,null,null,null,null,null,null,null,null,null,null,null,null,null,null,null,null,1,"Công trình dân dụng",0.16,0.106,8.3000000000000004E-2,6.2E-2,4.5999999999999999E-2,3.7999999999999999E-2,2.8000000000000001E-2,2.1000000000000001E-2,1.7999999999999999E-2]
[null,null,null,null,null,null,null,null,null,null,null,null,null,null,null,null,null,null,null,null,null,null,2,"Công trình công nghiệp",0.185,0.121,9.4E-2,7.1999999999999995E-2,5.5E-2,4.1000000000000002E-2,3.3000000000000002E-2,2.3E-2,0.02]
[null,null,null,null,null,null,null,null,null,null,null,null,null,null,null,null,null,null,null,null,null,null,3,"Công trình giao thông",0.106,6.8000000000000005E-2,5.3999999999999999E-2,4.1000000000000002E-2,3.1E-2,2.4E-2,0.02,1.4E-2,1.2E-2]
[null,null,null,null,null,null,null,null,null,null,null,null,null,null,null,null,null,null,null,null,null,null,4,"Công trình nông nghiệp và phát triển nông thôn",0.11700000000000001,7.5999999999999998E-2,0.06,4.5999999999999999E-2,3.5000000000000003E-2,2.5999999999999999E-2,2.1999999999999999E-2,1.6E-2,1.4E-2]
[null,null,null,null,null,null,null,null,null,null,null,null,null,null,null,null,null,null,null,null,null,null,5,"Công trình hạ tầng kỹ thuật",0.122,8.2000000000000003E-2,6.2E-2,4.7E-2,3.6999999999999998E-2,2.9000000000000001E-2,2.4E-2,1.7000000000000001E-2,1.4999999999999999E-2]
[]
[null,null,null,null,null,null,null,null,null,null,null,null,null,null,null,null,null,null,null,null,null,null,"Phụ lục số 2: Phí thẩm tra thiết kế xây dựng công trình sử dụng vốn ngân sách nhà nước khi cơ quan quản lý nhà nước thuê tổ chức tư vấn, cá nhân cùng thẩm tra"]
[]
[null,null,null,null,null,null,null,null,null,null,null,null,null,null,null,null,null,null,null,null,null,null,"1. Chi phí thẩm tra thiết kế"]
[null,null,null,null,null,null,null,null,null,null,null,null,null,null,null,null,null,null,null,null,null,null,null,null,null,null,null,null,null,null,null,"Đơn vị tính: Tỷ lệ %"]
[null,null,null,null,null,null,null,null,null,null,null,null,null,null,null,null,null,null,null,null,null,null,"TT","Loại công trình","Chi phí xây dựng (chưa có thuế GTGT) trong dự toán công trình hoặc dự toán gói thầu được duyệt (tỷ đồng)"]
[]
[null,null,null,null,null,null,null,null,null,null,null,null,null,null,null,null,null,null,null,null,null,null,null,null,15,50,100,200,500,1000,2000,5000,8000]
[null,null,null,null,null,null,null,null,null,null,null,null,null,null,null,null,null,null,null,null,null,null,1,"Công trình dân dụng",4.9500000000000002E-2,3.3000000000000002E-2,2.5499999999999998E-2,1.95E-2,1.4999999999999999E-2,1.23E-2,8.6999999999999994E-3,6.6E-3,5.7000000000000002E-3]
[null,null,null,null,null,null,null,null,null,null,null,null,null,null,null,null,null,null,null,null,null,null,2,"Công trình công nghiệp",5.7000000000000002E-2,3.78E-2,2.9100000000000001E-2,2.2499999999999999E-2,1.7399999999999999E-2,1.32E-2,1.0500000000000001E-2,7.7999999999999996E-3,6.6E-3]
[null,null,null,null,null,null,null,null,null,null,null,null,null,null,null,null,null,null,null,null,null,null,3,"Công trình giao thông",3.27E-2,2.1600000000000001E-2,1.6500000000000001E-2,1.29E-2,9.9000000000000008E-3,7.4999999999999997E-3,6.3E-3,4.7999999999999996E-3,4.1999999999999997E-3]
[null,null,null,null,null,null,null,null,null,null,null,null,null,null,null,null,null,null,null,null,null,null,4,"Công trình nông nghiệp và phát triển nông thôn",3.6299999999999999E-2,2.4E-2,1.83E-2,1.44E-2,1.11E-2,8.3999999999999995E-3,6.8999999999999999E-3,5.1000000000000004E-3,4.3E-3]
[null,null,null,null,null,null,null,null,null,null,null,null,null,null,null,null,null,null,null,null,null,null,5,"Công trình hạ tầng kỹ thuật",3.78E-2,2.5499999999999998E-2,1.95E-2,1.4999999999999999E-2,1.17E-2,8.9999999999999993E-3,7.8E-2,5.7000000000000002E-3,5.1000000000000004E-3]
[]
[]
[null,null,null,null,null,null,null,null,null,null,null,null,null,null,null,null,null,null,null,null,null,null,"2. Chi phí thẩm tra dự toán"]
[null,null,null,null,null,null,null,null,null,null,null,null,null,null,null,null,null,null,null,null,null,null,null,null,null,null,null,null,null,null,null,"Đơn vị tính: Tỷ lệ %"]
[null,null,null,null,null,null,null,null,null,null,null,null,null,null,null,null,null,null,null,null,null,null,"TT","Loại công trình","Chi phí xây dựng (chưa có thuế GTGT) trong dự toán công trình hoặc dự toán gói thầu được duyệt (tỷ đồng)"]
[]
[null,null,null,null,null,null,null,null,null,null,null,null,null,null,null,null,null,null,null,null,null,null,null,null,15,50,100,200,500,1000,2000,5000,8000]
[null,null,null,null,null,null,null,null,null,null,null,null,null,null,null,null,null,null,null,null,null,null,1,"Công trình dân dụng",4.8000000000000001E-2,3.1800000000000002E-2,2.4899999999999999E-2,1.8599999999999998E-2,1.38E-2,1.14E-2,8.3999999999999995E-3,6.3E-3,5.4000000000000003E-3]
[null,null,null,null,null,null,null,null,null,null,null,null,null,null,null,null,null,null,null,null,null,null,2,"Công trình công nghiệp",5.5500000000000001E-2,3.6299999999999999E-2,2.8199999999999999E-2,2.1600000000000001E-2,1.6500000000000001E-2,1.23E-2,9.9000000000000008E-3,6.8999999999999999E-3,6.0000000000000001E-3]
[null,null,null,null,null,null,null,null,null,null,null,null,null,null,null,null,null,null,null,null,null,null,3,"Công trình giao thông",3.1800000000000002E-2,2.0400000000000001E-2,1.6199999999999999E-2,1.23E-2,9.2999999999999992E-3,7.1999999999999998E-3,6.0000000000000001E-3,4.1999999999999997E-3,3.5999999999999999E-3]
[null,null,null,null,null,null,null,null,null,null,null,null,null,null,null,null,null,null,null,null,null,null,4,"Công trình nông nghiệp và phát triển nông thôn",3.5099999999999999E-2,2.2800000000000001E-2,1.7999999999999999E-2,1.38E-2,1.0500000000000001E-2,7.7999999999999996E-3,6.6E-3,4.7999999999999996E-3,4.1999999999999997E-3]
[null,null,null,null,null,null,null,null,null,null,null,null,null,null,null,null,null,null,null,null,null,null,5,"Công trình hạ tầng kỹ thuật",3.6600000000000001E-2,2.46E-2,1.8599999999999998E-2,1.41E-2,1.11E-2,8.6999999999999994E-3,7.1999999999999998E-3,5.1000000000000004E-3,4.1999999999999997E-3]
[]
[null,null,null,null,null,null,null,null,null,null,null,null,null,null,null,null,null,null,null,null,null,null,"Phụ lục số 3: Phí thẩm tra thiết kế xây dựng công trình sử dụng nguồn vốn khác"]
[null,null,null,null,null,null,null,null,null,null,null,null,null,null,null,null,null,null,null,null,null,null,null,null,null,null,null,null,null,null,null,"Đơn vị tính: Tỷ lệ %"]
[null,null,null,null,null,null,null,null,null,null,null,null,null,null,null,null,null,null,null,null,null,null,"TT","Loại công trình","Chi phí xây dựng (chưa có thuế GTGT) trong dự toán công trình hoặc dự toán gói thầu được duyệt (tỷ đồng)"]
[]
[null,null,null,null,null,null,null,null,null,null,null,null,null,null,null,null,null,null,null,null,null,null,null,null,15,50,100,200,500,1000,2000,5000,8000]
[null,null,null,null,null,null,null,null,null,null,null,null,null,null,null,null,null,null,null,null,null,null,1,"Công trình dân dụng",9.9000000000000005E-2,6.6000000000000003E-2,5.0999999999999997E-2,3.9E-2,0.03,2.4E-2,1.7000000000000001E-2,1.2999999999999999E-2,1.2E-2]
[null,null,null,null,null,null,null,null,null,null,null,null,null,null,null,null,null,null,null,null,null,null,2,"Công trình công nghiệp",0.114,7.5999999999999998E-2,5.8000000000000003E-2,4.4999999999999998E-2,3.5000000000000003E-2,2.5999999999999999E-2,2.1000000000000001E-2,1.6E-2,1.2999999999999999E-2]
[null,null,null,null,null,null,null,null,null,null,null,null,null,null,null,null,null,null,null,null,null,null,3,"Công trình giao thông",6.5000000000000002E-2,4.2999999999999997E-2,3.3000000000000002E-2,2.5999999999999999E-2,0.02,1.4999999999999999E-2,1.2E-2,0.01,8.0000000000000002E-3]
[null,null,null,null,null,null,null,null,null,null,null,null,null,null,null,null,null,null,null,null,null,null,4,"Công trình nông nghiệp và phát triển nông thôn",7.1999999999999995E-2,4.8000000000000001E-2,3.5999999999999997E-2,2.9000000000000001E-2,2.1999999999999999E-2,1.7000000000000001E-2,1.4E-2,0.01,8.9999999999999993E-3]
[null,null,null,null,null,null,null,null,null,null,null,null,null,null,null,null,null,null,null,null,null,null,5,"Công trình hạ tầng kỹ thuật",7.5999999999999998E-2,5.0999999999999997E-2,3.9E-2,0.03,2.4E-2,1.7999999999999999E-2,1.6E-2,1.2E-2,0.01]

{"sheet":"THDT goi thau XD","index":17,"n_rows":27,"n_cols":7,"rows_kept":27,"cut":false,"hidden":true,"merged":[]}
["BẢNG DỰ TOÁN GÓI THẦU THI CÔNG XÂY DỰNG"]
[{"$f":"Bia!D42&Bia!E42","v":"CÔNG TRÌNH: CÁC PHẦN MỀM QUẢN LÝ CHI PHÍ ĐTXD CT"}]
[null,null,null,null,"ĐVT: đồng"]
["STT","HẠNG MỤC","GIÁ TRỊ TRƯỚC THUẾ","THUẾ GTGT","GIÁ TRỊ SAU THUẾ","KÝ HIỆU","ĐMTL"]
["[1]","[2]","[3]","[4]","[5]","[6]"]
[1,"Chi phí xây dựng của gói thầu",{"$f":"SUM(C7:C8)","v":74229869753.525879},{"$f":"SUM(D7:D8)","v":7422986975.3525887},{"$f":"SUM(E7:E8)","v":81652856728.878479},"GXD"]
["1.1",{"$f":"\"Hạng mục: \"&'Du toan XD'!F9","v":"Hạng mục: PHẦN MÓNG"},{"$f":"'THCP xay dung'!D20","v":43178795725.27137},{"$f":"'THCP xay dung'!D21","v":4317879572.5271368},{"$f":"'THCP xay dung'!D22","v":47496675297.798508}]
["1.2",{"$f":"\"Hạng mục: \"&'Du toan XD'!F14","v":"Hạng mục: PHẦN THÂN"},{"$f":"'THCP xay dung'!D45","v":31051074028.254517},{"$f":"'THCP xay dung'!D46","v":3105107402.8254519},{"$f":"'THCP xay dung'!D47","v":34156181431.079967}]
[2,"Chi phí hạng mục chung",{"$f":"SUM(C10:C12)","v":2598045441.3734059},{"$f":"SUM(D10:D12)","v":259804544.13734061},{"$f":"SUM(E10:E12)","v":2857849985.510747},"CHMC"]
["2.1","Chi phí xây dựng nhà tạm tại hiện trường để ở và điều hành thi công",{"$f":"C6*$G$10","v":742298697.53525877},{"$f":"D6*$G$10","v":74229869.753525883},{"$f":"E6*$G$10","v":816528567.28878486},"CNT",{"$f":"'CP HMC'!D7","v":0.01}]
["2.2","Chi phí một số công tác không xác định được khối lượng từ thiết kế",{"$f":"C6*$G$11","v":1855746743.8381472},{"$f":"D6*$G$11","v":185574674.38381472},{"$f":"E6*$G$11","v":2041321418.221962},"CKKL",{"$f":"'CP HMC'!D8","v":2.5000000000000001E-2}]
["2.3","Các chi phí hạng mục chung khác",{"$f":"SUM(C13:C15)","v":0},{"$f":"SUM(D13:D15)","v":0},{"$f":"SUM(E13:E15)","v":0},"CK"]
[null,"Chi phí di chuyển thiết bị thi công và lực lượng lao động đến công trường"]
[null,"Chi phí đảm bảo an toàn giao thông phục vụ thi công"]
[null,"…"]
[3,"Chi phí dự phòng",null,null,{"$f":"SUM(E17:E18)","v":6169281590.1504126},"GDP"]
[null,"Chi phí dự phòng cho yếu tố khối lượng phát sinh",{"$f":"(C6+C9)*$G$17","v":3841395759.7449646},{"$f":"(D6+D9)*$G$17","v":384139575.97449648},{"$f":"(E6+E9)*$G$17","v":4225535335.7194614},null,{"$f":"'CP Du phong'!E63","v":0.05}]
[null,"Chi phí dự phòng cho yếu tố trượt giá",{"$f":"(C6+C9)*$G$18","v":1767042049.4826832},{"$f":"(D6+D9)*$G$18","v":176704204.94826832},{"$f":"(E6+E9)*$G$18","v":1943746254.4309514},null,{"$f":"IF('CP Du phong'!D98=0,0,'CP Du phong'!D98-'THDT goi thau XD'!G17)","v":2.2999999999999993E-2}]
[null,"TỔNG CỘNG (1+2+3)",null,null,{"$f":"SUM(E6,E9,E16)","v":90679988304.539627},"GGTXD",{"$f":"SUM(G6:G6)","v":0}]
[]
[null,{"$f":"\"(Bằng chữ: \"&vnd(E19)&\")\"","v":"(Bằng chữ: Chín mươi tỷ sáu trăm bảy mươi chín triệu chín trăm tám mươi tám nghìn ba trăm linh năm đồng.)"}]
[]
["NGƯỜI LẬP",null,null,"NGƯỜI CHỦ TRÌ"]
[]
[]
[]
[null,null,null,"Chứng chỉ hành nghề định giá XD hạng …, số …               "]

{"sheet":"THCP xay dung","index":18,"n_rows":56,"n_cols":7,"rows_kept":56,"cut":false,"hidden":false,"merged":[]}
["BẢNG TỔNG HỢP DỰ TOÁN CHI PHÍ XÂY DỰNG"]
[{"$f":"Bia!D42&Bia!E42","v":"CÔNG TRÌNH: CÁC PHẦN MỀM QUẢN LÝ CHI PHÍ ĐTXD CT"}]
[{"$f":"\"Hạng mục: \"&'Du toan XD'!F9","v":"Hạng mục: PHẦN MÓNG"}]
[null,null,null,null,"ĐVT: đồng"]
["STT","KHOẢN MỤC CHI PHÍ","CÁCH TÍNH","GIÁ TRỊ","KÝ HIỆU","HS1","HS2"]
[null,"CHI PHÍ THEO ĐƠN GIÁ"]
[null,"Chi phí vật liệu",null,{"$f":"'Du toan XD'!M13+'Du toan XD'!N13","v":24092110548},"A"]
[null,"Chênh lệch vật liệu",null,null,"CLVL"]
[null,"Chi phí nhân công",null,{"$f":"'Du toan XD'!O13","v":12476842191},"B"]
[null,"Chênh lệch nhân công",null,null,"CLNC"]
[null,"Chi phí máy xây dựng",null,{"$f":"'Du toan XD'!P13","v":1987011279},"C"]
[null,"Chênh lệch máy xây dựng",null,null,"CLM"]
["I","CHI PHÍ TRỰC TIẾP"]
[1,"Chi phí vật liệu",{"$f":"IF(F14=0,\"A+CLVL\",IF(D8=0,\"A*\"&F14,\"(A + CLVL) * \"&F14))","v":"A*1"},{"$f":"IF(F14=0,D7+D8,(D7+D8)*F14)","v":24092110548},"VL",{"$f":"ROUND(Ts!$O$51,3)","v":1}]
[2,"Chi phí nhân công",{"$f":"IF(F15=0,\"B+CLNC\",IF($D$10<>0,IF(G15<>0,\"B*\"&F15&\"*\"&G15&\"+CLNC\",\"B*\"&F15&\"+CLNC\"),IF(G15<>0,\"B*\"&F15&\"*\"&G15,\"B*\"&F15)))","v":"B*1"},{"$f":"PRODUCT(D9,F15:G15)+D10","v":12476842191},"NC",{"$f":"ROUND(Ts!$O$52,4)","v":1}]
[3,"Chi phí máy thi công",{"$f":"IF(F16=0,\"C+CLM\",IF($D$12<>0,IF(G16<>0,\"C*\"&F16&\"*\"&G16&\"+CLM\",\"C*\"&F16&\"+CLM\"),IF(G16<>0,\"C*\"&F16&\"*\"&G16,\"C*\"&F16)))","v":"C*1"},{"$f":"PRODUCT(D11,F16:G16)+D12","v":1987011279},"M",{"$f":"ROUND(Ts!$O$53,4)","v":1}]
[null,"Chi phí trực tiếp","VL+NC+M",{"$f":"THCP_VL+THCP_NC+THCP_M","v":38555964018},"T"]
["II","CHI PHÍ CHUNG",{"$f":"\"T*\"&F18*100&\"%\"","v":"T*6,15158900155001%"},{"$f":"THCP_T*TPCP_hsCPC","v":2371804441.9728656},"C",{"$f":"Ts!$O$54","v":6.1515890015500056E-2}]
["III","THU NHẬP CHỊU THUẾ TÍNH TRƯỚC",{"$f":"\"(T+C)*\"&F19*100&\"%\"","v":"(T+C)*5,5%"},{"$f":"(THCP_T+THCP_C)*THCP_hsTL","v":2251027265.2985072},"TL",{"$f":"Ts!$O$55","v":5.5E-2}]
[null,"Chi phí xây dựng trước thuế","T+C+TL",{"$f":"THCP_T+THCP_C+THCP_TL","v":43178795725.27137},"G"]
["IV","THUẾ GIÁ TRỊ GIA TĂNG",{"$f":"\"G*\"&F21*100&\"%\"","v":"G*10%"},{"$f":"THCP_G*THCP_hsGTGT","v":4317879572.5271368},"GTGT",{"$f":"Ts!$O$56","v":0.1}]
[null,"Chi phí xây dựng sau thuế","G+GTGT",{"$f":"THCP_G+THCP_GTGT","v":47496675297.798508},"GXD"]
[null,"Chi phí dự phòng",{"$f":"\"GXD*\"&F23*100&\"%\"","v":"GXD*7,5555%"},{"$f":"THCP_GXD*THCP_hsCPDP","v":3588611302.1251659},"GDP",{"$f":"'CP Du phong'!$D$103","v":7.5554999999999997E-2}]
[null,"GIÁ DỰ THẦU","GXD+GDP",{"$f":"THCP_GXD+THCP_CPDP","v":51085286599.923676},"GGTXD"]
[]
["BẢNG TỔNG HỢP DỰ TOÁN CHI PHÍ XÂY DỰNG"]
[{"$f":"'Bia1'!D42&'Bia1'!E42","v":"CÔNG TRÌNH: CÁC PHẦN MỀM QUẢN LÝ CHI PHÍ ĐTXD CT"}]
[{"$f":"\"Hạng mục: \"&'Du toan XD'!F14","v":"Hạng mục: PHẦN THÂN"}]
[null,null,null,null,"ĐVT: đồng"]
["STT","KHOẢN MỤC CHI PHÍ","CÁCH TÍNH","GIÁ TRỊ","KÝ HIỆU","HS1","HS2"]
[null,"CHI PHÍ THEO ĐƠN GIÁ"]
[null,"Chi phí vật liệu",null,{"$f":"'Du toan XD'!M38+'Du toan XD'!N38","v":19625517252},"A"]
[null,"Chênh lệch vật liệu",null,null,"CLVL"]
[null,"Chi phí nhân công",null,{"$f":"'Du toan XD'!O38","v":5833706571},"B"]
[null,"Chênh lệch nhân công",null,null,"CLNC"]
[null,"Chi phí máy xây dựng",null,{"$f":"'Du toan XD'!P38","v":2267443233},"C"]
[null,"Chênh lệch máy xây dựng",null,null,"CLM"]
["I","CHI PHÍ TRỰC TIẾP"]
[1,"Chi phí vật liệu",{"$f":"IF(F39=0,\"A+CLVL\",IF(D33=0,\"A*\"&F39,\"(A + CLVL) * \"&F39))","v":"A*1"},{"$f":"IF(F39=0,D32+D33,(D32+D33)*F39)","v":19625517252},"VL",{"$f":"ROUND(Ts!$O$51,3)","v":1}]
[2,"Chi phí nhân công",{"$f":"IF(F40=0,\"B+CLNC\",IF($D$10<>0,IF(G40<>0,\"B*\"&F40&\"*\"&G40&\"+CLNC\",\"B*\"&F40&\"+CLNC\"),IF(G40<>0,\"B*\"&F40&\"*\"&G40,\"B*\"&F40)))","v":"B*1"},{"$f":"PRODUCT(D34,F40:G40)+D35","v":5833706571},"NC",{"$f":"ROUND(Ts!$O$52,4)","v":1}]
[3,"Chi phí máy thi công",{"$f":"IF(F41=0,\"C+CLM\",IF($D$12<>0,IF(G41<>0,\"C*\"&F41&\"*\"&G41&\"+CLM\",\"C*\"&F41&\"+CLM\"),IF(G41<>0,\"C*\"&F41&\"*\"&G41,\"C*\"&F41)))","v":"C*1"},{"$f":"PRODUCT(D36,F41:G41)+D37","v":2267443233},"M",{"$f":"ROUND(Ts!$O$53,4)","v":1}]
[null,"Chi phí trực tiếp","VL+NC+M",{"$f":"D39+D40+D41","v":27726667056},"T"]
["II","CHI PHÍ CHUNG",{"$f":"\"T*\"&F43*100&\"%\"","v":"T*6,15158900155001%"},{"$f":"D42*F43","v":1705630601.1132848},"C",{"$f":"Ts!$O$54","v":6.1515890015500056E-2}]
["III","THU NHẬP CHỊU THUẾ TÍNH TRƯỚC",{"$f":"\"(T+C)*\"&F44*100&\"%\"","v":"(T+C)*5,5%"},{"$f":"(D42+D43)*F44","v":1618776371.1412306},"TL",{"$f":"Ts!$O$55","v":5.5E-2}]
[null,"Chi phí xây dựng trước thuế","T+C+TL",{"$f":"D42+D43+D44","v":31051074028.254517},"G"]
["IV","THUẾ GIÁ TRỊ GIA TĂNG",{"$f":"\"G*\"&F46*100&\"%\"","v":"G*10%"},{"$f":"D45*F46","v":3105107402.8254519},"GTGT",{"$f":"Ts!$O$56","v":0.1}]
[null,"Chi phí xây dựng sau thuế","G+GTGT",{"$f":"D45+D46","v":34156181431.079967},"GXD"]
[null,"Chi phí dự phòng",{"$f":"\"GXD*\"&F48*100&\"%\"","v":"GXD*7,5555%"},{"$f":"D47*F48","v":2580670288.0252466},"GDP",{"$f":"'CP Du phong'!$D$103","v":7.5554999999999997E-2}]
[null,"GIÁ DỰ THẦU","GXD+GDP",{"$f":"D47+D48","v":36736851719.105217},"GGTXD"]
[]
[]
[null,"NGƯỜI LẬP","NGƯỜI CHỦ TRÌ"]
[]
[]
[]
[null,null,"Chứng chỉ hành nghề định giá XD hạng …, số …               "]

{"sheet":"Don gia tong hop","index":19,"n_rows":10,"n_cols":25,"rows_kept":10,"cut":false,"hidden":true,"merged":[[3,12,4,12],[3,17,4,17],[3,23,4,23],[3,24,4,24],[3,18,4,18],[3,19,4,19],[3,20,4,20],[3,21,4,21],[3,22,4,22],[3,7,4,7],[3,8,4,8],[3,9,4,9],[3,10,4,10],[3,11,4,11],[3,2,4,2],[3,3,4,3],[3,4,4,4],[3,5,4,5],[3,6,4,6]]}
[null,null,"BẢNG PHÂN TÍCH ĐƠN GIÁ XÂY DỰNG TỔNG HỢP"]
[null,null,{"$f":" \"Hạng mục công việc: \"&H10","v":"Hạng mục công việc: Công tác tổng hợp 1"}]
[]
[null,null,"STT","MÃ VỮA","MH\nĐỊNH MỨC","MH\nĐƠN GIÁ","MSVT","THÀNH PHẦN CÔNG VIỆC","ĐƠN VỊ","KHỐI LƯỢNG","HAO PHÍ ĐỊNH MỨC","GIÁ VẬT TƯ","HỆ SỐ","THẦN PHẦN CHI PHÍ",null,null,null,"TỔNG CỘNG","CHI PHÍ CHUNG","TN CT TÍNH TRƯỚC","ĐƠN GIÁ XD TRƯỚC THUẾ","THUẾ GTGT","ĐƠN GIÁ XD SAU THUẾ","CHI PHÍ DỰ PHÒNG","ĐƠN GIÁ THẦU"]
[null,null,null,null,null,null,null,null,null,null,null,null,null,"Vật liệu","Vật liệu phụ","Nhân công","Máy"]
[null,null,"[1]","[1']","[1'']","[2]","[2']","[3]","[4]","[5]","[6]","[7]","[8]","[9]","[9']","[10]","[11]","[12]","[13]","[14]","[15]","[16]","[17]","[18]","[19]"]
[]
[]
[null,null,null,null,null,null,null,"Cộng",null,1]
[null,null,null,null,null,"TH1",null,"Công tác tổng hợp 1","ĐVT",null,null,null,null,null,null,null,null,null,null,null,{"$f":"SUM(R10:T10)","v":0},null,{"$f":"SUM(U10:V10)","v":0},null,{"$f":"SUM(W10:X10)","v":0}]

{"sheet":"Du toan XD","index":20,"n_rows":47,"n_cols":32,"rows_kept":47,"cut":false,"hidden":false,"merged":[[4,0,5,0],[4,23,5,23],[4,1,5,1],[4,5,5,5],[4,6,5,6],[4,16,5,16],[4,20,5,20],[4,4,5,4],[4,7,5,7],[4,3,5,3],[4,2,5,2],[4,21,5,21],[4,22,5,22]]}
[null,"BẢNG DỰ TOÁN CHI PHÍ XÂY DỰNG",null,null,null,null,null,null,null,null,null,null,null,null,null,null,null,null,null,null,null,null,null,null,">>>>>"]
[null,{"$f":"Bia!D42&Bia!E42","v":"CÔNG TRÌNH: CÁC PHẦN MỀM QUẢN LÝ CHI PHÍ ĐTXD CT"}]
[null,{"$f":"Bia!D43&Bia!E43","v":"HẠNG MỤC: PHẦN MỀM DỰ TOÁN GXD 10"}]
[null,null,null,null,null,null,null,null,null,null,null,null,null,null,null,"ĐVT: đồng"]
["ID","STT","MÃ VỮA","MÃ HIỆU ĐỊNH MỨC","MÃ HIỆU ĐƠN GIÁ","NỘI DUNG CÔNG VIỆC","ĐƠN VỊ","KHỐI LƯỢNG","ĐƠN GIÁ",null,null,null,"THÀNH TIỀN",null,null,null,"SỐ BỘ PHẬN GIỐNG NHAU","KÍCH THƯỚC",null,null,"HỆ SỐ","K.L MỘT BỘ PHẬN","K.L TOÀN BỘ","GHI CHÚ"]
[null,null,null,null,null,null,null,null,"VẬT LIỆU","VẬT LIỆU P","NHÂN CÔNG","MÁY","VẬT LIỆU","VẬT LIỆU P","NHÂN CÔNG","MÁY",null,"DÀI","RỘNG","CAO (SÂU)"]
[null,"[1]","[1a]","[1b]","[2]","[3]","[4]","[5]","[6]","[6']","[7]","[8]","[9]=[5]*[6]","[9']=[5]*[6']","[10]=[5]*[7]","[11]=[5]*[8]","[5]","[6]","[6']","[7]","[8]","[9]","[10]","[11]"]
[]
["HM1",null,null,null,"HM","PHẦN MÓNG"]
[1,1,"C2125","AG.11110","AG.11115","Sản xuất cấu kiện bê tông đúc sẵn, bê tông cọc, cột, vữa bê tông đá 1x2 mác 300","m³",9999,1172016,null,364395,73946,{"$f":"H10*I10","v":11718987984},{"$f":"H10*J10","v":0},{"$f":"H10*K10","v":3643585605},{"$f":"H10*L10","v":739386054},null,null,null,null,null,null,null,null,null,null,null,null,null,null,null,"Các công việc và khối lượng trong bảng dự toán này là giả định"]
[2,2,"C2123","AG.11210","AG.11213","Sản xuất cấu kiện bê tông đúc sẵn, bê tông xà dầm, vữa bê tông đá 1x2 mác 200","m³",9999,647498,null,383246,73946,{"$f":"H11*I11","v":6474332502},{"$f":"H11*J11","v":0},{"$f":"H11*K11","v":3832076754},{"$f":"H11*L11","v":739386054}]
[3,3,"C2122","AG.11310","AG.11312","Sản xuất cấu kiện bê tông đúc sẵn, bê tông panen 3 mặt, vữa bê tông đá 1x2 mác 150","m³",9999,589938,null,500168,50829,{"$f":"H12*I12","v":5898790062},{"$f":"H12*J12","v":0},{"$f":"H12*K12","v":5001179832},{"$f":"H12*L12","v":508239171}]
[null,null,null,null,"TC",{"$f":" \"Cộng: \"&F9","v":"Cộng: PHẦN MÓNG"},null,null,null,null,null,null,{"$f":"SUM(M9:M12)","v":24092110548},{"$f":"SUM(N9:N12)","v":0},{"$f":"SUM(O9:O12)","v":12476842191},{"$f":"SUM(P9:P12)","v":1987011279}]
["HM2",null,null,null,"HM","PHẦN THÂN"]
[4,1,"C2223","AF.21210","AF.21213","Bê tông sản xuất qua dây chuyền trạm trộn tại hiện trường hoặc vữa bê tông thương phẩm từ các cơ sở sản xuất tập trung và đổ bằng cần cẩu, chiều rộng móng ≤250cm, bê tông móng, vữa bê tông đá 1x2 mác 200","m³",9999,671356,null,177219,75589,{"$f":"H15*I15","v":6712888644},{"$f":"H15*J15","v":0},{"$f":"H15*K15","v":1772012781},{"$f":"H15*L15","v":755814411}]
[5,2,"C2223","AF.21220","AF.21223","Bê tông sản xuất qua dây chuyền trạm trộn tại hiện trường hoặc vữa bê tông thương phẩm từ các cơ sở sản xuất tập trung và đổ bằng cần cẩu, chiều rộng móng >250cm, bê tông móng, vữa bê tông đá 1x2 mác 200","m³",9999,705824,null,228991,75589,{"$f":"H16*I16","v":7057534176},{"$f":"H16*J16","v":0},{"$f":"H16*K16","v":2289681009},{"$f":"H16*L16","v":755814411}]
[6,3,"C2232","AF.21210","AF.21232","Bê tông sản xuất qua dây chuyền trạm trộn tại hiện trường hoặc vữa bê tông thương phẩm từ các cơ sở sản xuất tập trung và đổ bằng cần cẩu, chiều rộng móng ≤250cm, bê tông móng, vữa bê tông đá 2x4 mác 150","m³",9999,585568,null,177219,75589,{"$f":"H17*I17","v":5855094432},{"$f":"H17*J17","v":0},{"$f":"H17*K17","v":1772012781},{"$f":"H17*L17","v":755814411}]
[]
[]
[]
[]
[]
[]
[]
[]
[]
[]
[]
[]
[]
[]
[]
[]
[]
[]
[]
[]
[null,null,null,null,"TC",{"$f":" \"Cộng: \"&F14","v":"Cộng: PHẦN THÂN"},null,null,null,null,null,null,{"$f":"SUM(M14:M37)","v":19625517252},{"$f":"SUM(N14:N37)","v":0},{"$f":"SUM(O14:O37)","v":5833706571},{"$f":"SUM(P14:P37)","v":2267443233}]
[null,null,null,null,"TC","Tổng cộng",null,null,null,null,null,null,{"$f":"M13+M38","v":43717627800},{"$f":"N13+N38","v":0},{"$f":"O13+O38","v":18310548762},{"$f":"P13+P38","v":4254454512}]
[null,null,null,null,null,null,null,null,null,null,null,null,"A","Ap","B","C"]
[null,null,null,null,null,null,null,null,null,null,null,null,null,null,null,null,"(ký tên)",null,null,null,null,"(ký tên)"]
[]
[]
[null,null,null,null,null,null,null,null,null,null,null,null,null,null,null,null,null,null,null,null,null,"Chứng chỉ KS định giá XD hạng ..., số …"]
[]
[null,null,null,null,null,null,null,null,null,null,null,null,null,null,null,null,"Thủ trưởng đơn vị thực hiện đo bóc khối lượng"]
[null,null,null,null,null,null,null,null,null,null,null,null,null,null,null,null,"(ký tên và đóng dấu)"]

{"sheet":"Don gia XD","index":21,"n_rows":68,"n_cols":19,"rows_kept":68,"cut":false,"hidden":false,"merged":[]}
[null,"BẢNG PHÂN TÍCH ĐƠN GIÁ CHI TIẾT"]
[null,{"$f":"Bia!D42&Bia!E42","v":"CÔNG TRÌNH: CÁC PHẦN MỀM QUẢN LÝ CHI PHÍ ĐTXD CT"}]
[null,{"$f":"Bia!D43&Bia!E43","v":"HẠNG MỤC: PHẦN MỀM DỰ TOÁN GXD 10"}]
[null,null,null,null,null,null,null,null,null,null,null,null,"ĐVT: đồng"]
["ID","STT","MÃ VỮA","MÃ HIỆU ĐỊNH MỨC","MÃ HIỆU\nĐƠN GIÁ","MSVT","TÊN CÔNG VIỆC / THÀNH PHẦN HAO PHÍ","ĐƠN VỊ","KHỐI LƯỢNG","ĐỊNH MỨC\nHAO PHÍ","ĐƠN GIÁ","HỆ SỐ","THÀNH TIỀN","HAO PHÍ","HAO PHÍ KHÁC","ĐGVL","ĐGVLP","ĐGNC","ĐGM"]
[null,"[1]",null,null,"[2]","[3]","[4]","[5]","[6]","[7]","[8]","[9]","[10]","[11]","[12]"]
[{"$f":"'Du toan XD'!A9","v":"HM1"},{"$f":"'Du toan XD'!E9","v":"HM"},null,null,null,null,{"$f":"'Du toan XD'!F9","v":"PHẦN MÓNG"}]
[{"$f":"'Du toan XD'!A10","v":1},{"$f":"'Du toan XD'!B10","v":1},"C2125","AG.11110","AG.11115",null,{"$f":"'Du toan XD'!F10","v":"Sản xuất cấu kiện bê tông đúc sẵn, bê tông cọc, cột, vữa bê tông đá 1x2 mác 300"},{"$f":"'Du toan XD'!G10","v":"m³"},{"$f":"'Du toan XD'!H10","v":9999},null,null,null,null,null,null,{"$f":"M9","v":1172015.5792799997},null,{"$f":"M12","v":364395.09},{"$f":"M14","v":73946.449500000002}]
[null,null,null,null,null,null,"Vật liệu",null,null,{"$f":"Config!C36","v":1},null,null,{"$f":"SUM(M10:M11)*J9","v":1172015.5792799997}]
[null,null,"C2125",null,null,"C2125","Vữa bê tông M300, XM PC30, cát vàng, đá 1x2, độ sụt 2 - 4cm","m3",null,1.0149999999999999,1148950.3999999999,null,{"$f":"IF(L10=0,J10*K10,J10*K10*L10)","v":1166184.6559999997},{"$f":"IF(L10=0,I8*J10,I8*J10*L10)","v":10148.984999999999},{"$f":"J11%*N10","v":50.744924999999995}]
[null,null,null,null,null,"V19999","Vật liệu khác","%",null,0.5,null,null,{"$f":"SUM(M10:M10)*J11%","v":5830.9232799999991},null,{"$f":"J11%*N11","v":0}]
[null,null,null,null,null,null,"Nhân công",null,null,{"$f":"Config!C37","v":1},null,null,{"$f":"SUM(M13:M13)*J12","v":364395.09},null,{"$f":"J11%*N12","v":0}]
[null,null,null,null,null,"N1307","Nhân công 3,0/7 (nhóm 1)","công",null,1.83,199123,null,{"$f":"IF(L13=0,J13*K13,J13*K13*L13)","v":364395.09},{"$f":"IF(L13=0,I8*J13,I8*J13*L13)","v":18298.170000000002},{"$f":"J11%*N13","v":91.490850000000009}]
[null,null,null,null,null,null,"Máy thi công",null,null,{"$f":"Config!C38","v":1},null,null,{"$f":"SUM(M15:M17)*J14","v":73946.449500000002},null,{"$f":"J11%*N14","v":0}]
[null,null,null,null,null,"M0313","Máy trộn bê tông 250l","ca",null,9.5000000000000001E-2,270051,null,{"$f":"IF(L15=0,J15*K15,J15*K15*L15)","v":25654.845000000001},{"$f":"IF(L15=0,I8*J15,I8*J15*L15)","v":949.90499999999997},{"$f":"J17%*N15","v":94.990499999999997}]
[null,null,null,null,null,"M0355","Đầm dùi 1,5Kw","ca",null,0.18,230940,null,{"$f":"IF(L16=0,J16*K16,J16*K16*L16)","v":41569.199999999997},{"$f":"IF(L16=0,I8*J16,I8*J16*L16)","v":1799.82},{"$f":"J17%*N16","v":179.982}]
["TC",null,null,null,null,"M9999","Máy khác","%",null,10,null,null,{"$f":"SUM(M15:M16)*J17%","v":6722.4045000000006}]
[{"$f":"'Du toan XD'!A11","v":2},{"$f":"'Du toan XD'!B11","v":2},"C2123","AG.11210","AG.11213",null,{"$f":"'Du toan XD'!F11","v":"Sản xuất cấu kiện bê tông đúc sẵn, bê tông xà dầm, vữa bê tông đá 1x2 mác 200"},{"$f":"'Du toan XD'!G11","v":"m³"},{"$f":"'Du toan XD'!H11","v":9999},null,null,null,null,null,null,{"$f":"M19","v":647498.21666249994},null,{"$f":"M22","v":383245.71},{"$f":"M24","v":73946.449500000002}]
[null,null,null,null,null,null,"Vật liệu",null,null,{"$f":"Config!C36","v":1},null,null,{"$f":"SUM(M20:M21)*J19","v":647498.21666249994}]
[null,null,"C2123",null,null,"C2123","Vữa bê tông M200, XM PC30, cát vàng, đá 1x2, độ sụt 2 - 4cm","m3",null,1.0149999999999999,634755.5,null,{"$f":"IF(L20=0,J20*K20,J20*K20*L20)","v":644276.8324999999},{"$f":"IF(L20=0,I18*J20,I18*J20*L20)","v":10148.984999999999},{"$f":"J21%*N20","v":50.744924999999995}]
[null,null,null,null,null,"V19999","Vật liệu khác","%",null,0.5,null,null,{"$f":"SUM(M20:M20)*J21%","v":3221.3841624999995},null,{"$f":"J21%*N21","v":0}]
[null,null,null,null,null,null,"Nhân công",null,null,{"$f":"Config!C37","v":1},null,null,{"$f":"SUM(M23:M23)*J22","v":383245.71},null,{"$f":"J21%*N22","v":0}]
[null,null,null,null,null,"N1357","Nhân công 3,5/7 (nhóm 1)","công",null,1.77,216523,null,{"$f":"IF(L23=0,J23*K23,J23*K23*L23)","v":383245.71},{"$f":"IF(L23=0,I18*J23,I18*J23*L23)","v":17698.23},{"$f":"J21%*N23","v":88.491150000000005}]
[null,null,null,null,null,null,"Máy thi công",null,null,{"$f":"Config!C38","v":1},null,null,{"$f":"SUM(M25:M27)*J24","v":73946.449500000002}]
[null,null,null,null,null,"M0313","Máy trộn bê tông 250l","ca",null,9.5000000000000001E-2,270051,null,{"$f":"IF(L25=0,J25*K25,J25*K25*L25)","v":25654.845000000001},{"$f":"IF(L25=0,I18*J25,I18*J25*L25)","v":949.90499999999997},{"$f":"J27%*N25","v":94.990499999999997}]
[null,null,null,null,null,"M0355","Đầm dùi 1,5Kw","ca",null,0.18,230940,null,{"$f":"IF(L26=0,J26*K26,J26*K26*L26)","v":41569.199999999997},{"$f":"IF(L26=0,I18*J26,I18*J26*L26)","v":1799.82},{"$f":"J27%*N26","v":179.982}]
["TC",null,null,null,null,"M9999","Máy khác","%",null,10,null,null,{"$f":"SUM(M25:M26)*J27%","v":6722.4045000000006}]
[{"$f":"'Du toan XD'!A12","v":3},{"$f":"'Du toan XD'!B12","v":3},"C2122","AG.11310","AG.11312",null,{"$f":"'Du toan XD'!F12","v":"Sản xuất cấu kiện bê tông đúc sẵn, bê tông panen 3 mặt, vữa bê tông đá 1x2 mác 150"},{"$f":"'Du toan XD'!G12","v":"m³"},{"$f":"'Du toan XD'!H12","v":9999},null,null,null,null,null,null,{"$f":"M29","v":589938.44463749998},null,{"$f":"M32","v":500168.13},{"$f":"M34","v":50829.355500000005}]
[null,null,null,null,null,null,"Vật liệu",null,null,{"$f":"Config!C36","v":1},null,null,{"$f":"SUM(M30:M31)*J29","v":589938.44463749998}]
[null,null,"C2122",null,null,"C2122","Vữa bê tông M150, XM PC30, cát vàng, đá 1x2, độ sụt 2 - 4cm","m3",null,1.0149999999999999,578328.5,null,{"$f":"IF(L30=0,J30*K30,J30*K30*L30)","v":587003.42749999999},{"$f":"IF(L30=0,I28*J30,I28*J30*L30)","v":10148.984999999999},{"$f":"J31%*N30","v":50.744924999999995}]
[null,null,null,null,null,"V19999","Vật liệu khác","%",null,0.5,null,null,{"$f":"SUM(M30:M30)*J31%","v":2935.0171375},null,{"$f":"J31%*N31","v":0}]
[null,null,null,null,null,null,"Nhân công",null,null,{"$f":"Config!C37","v":1},null,null,{"$f":"SUM(M33:M33)*J32","v":500168.13},null,{"$f":"J31%*N32","v":0}]
[null,null,null,null,null,"N1357","Nhân công 3,5/7 (nhóm 1)","công",null,2.31,216523,null,{"$f":"IF(L33=0,J33*K33,J33*K33*L33)","v":500168.13},{"$f":"IF(L33=0,I28*J33,I28*J33*L33)","v":23097.690000000002},{"$f":"J31%*N33","v":115.48845000000001}]
[null,null,null,null,null,null,"Máy thi công",null,null,{"$f":"Config!C38","v":1},null,null,{"$f":"SUM(M35:M37)*J34","v":50829.355500000005}]
[null,null,null,null,null,"M0313","Máy trộn bê tông 250l","ca",null,9.5000000000000001E-2,270051,null,{"$f":"IF(L35=0,J35*K35,J35*K35*L35)","v":25654.845000000001},{"$f":"IF(L35=0,I28*J35,I28*J35*L35)","v":949.90499999999997},{"$f":"J37%*N35","v":94.990499999999997}]
[null,null,null,null,null,"M0355","Đầm dùi 1,5Kw","ca",null,8.8999999999999996E-2,230940,null,{"$f":"IF(L36=0,J36*K36,J36*K36*L36)","v":20553.66},{"$f":"IF(L36=0,I28*J36,I28*J36*L36)","v":889.91099999999994},{"$f":"J37%*N36","v":88.991100000000003}]
["TC",null,null,null,null,"M9999","Máy khác","%",null,10,null,null,{"$f":"SUM(M35:M36)*J37%","v":4620.8505000000005}]
[{"$f":"'Du toan XD'!A14","v":"HM2"},{"$f":"'Du toan XD'!E14","v":"HM"},null,null,null,null,{"$f":"'Du toan XD'!F14","v":"PHẦN THÂN"}]
[{"$f":"'Du toan XD'!A15","v":4},{"$f":"'Du toan XD'!B15","v":1},"C2223","AF.21210","AF.21213",null,{"$f":"'Du toan XD'!F15","v":"Bê tông sản xuất qua dây chuyền trạm trộn tại hiện trường hoặc vữa bê tông thương phẩm từ các cơ sở sản xuất tập trung và đổ bằng cần cẩu, chiều rộng móng ≤250cm, bê tông móng, vữa bê tông đá 1x2 mác 200"},{"$f":"'Du toan XD'!G15","v":"m³"},{"$f":"'Du toan XD'!H15","v":9999},null,null,null,null,null,null,{"$f":"M40","v":671356.00162500003},null,{"$f":"M43","v":177219.47},{"$f":"M45","v":75589.11}]
[null,null,null,null,null,null,"Vật liệu",null,null,{"$f":"Config!C36","v":1},null,null,{"$f":"SUM(M41:M42)*J40","v":671356.00162500003}]
[null,null,"C2223",null,null,"C2223","Vữa bê tông M200, XM PC30, cát vàng, đá 1x2, độ sụt 6 - 8cm","m3",null,1.0249999999999999,648496.5,null,{"$f":"IF(L41=0,J41*K41,J41*K41*L41)","v":664708.91249999998},{"$f":"IF(L41=0,I39*J41,I39*J41*L41)","v":10248.974999999999},{"$f":"J42%*N41","v":102.48974999999999}]
[null,null,null,null,null,"V19999","Vật liệu khác","%",null,1,null,null,{"$f":"SUM(M41:M41)*J42%","v":6647.0891249999995},null,{"$f":"J42%*N42","v":0}]
[null,null,null,null,null,null,"Nhân công",null,null,{"$f":"Config!C37","v":1},null,null,{"$f":"SUM(M44:M44)*J43","v":177219.47},null,{"$f":"J42%*N43","v":0}]
[null,null,null,null,null,"N1307","Nhân công 3,0/7 (nhóm 1)","công",null,0.89,199123,null,{"$f":"IF(L44=0,J44*K44,J44*K44*L44)","v":177219.47},{"$f":"IF(L44=0,I39*J44,I39*J44*L44)","v":8899.11},{"$f":"J42%*N44","v":88.991100000000003}]
[null,null,null,null,null,null,"Máy thi công",null,null,{"$f":"Config!C38","v":1},null,null,{"$f":"SUM(M46:M47)*J45","v":75589.11}]
[null,null,null,null,null,"M0224","Cần trục bánh xích 10 tấn","ca",null,0.03,1834515,null,{"$f":"IF(L46=0,J46*K46,J46*K46*L46)","v":55035.45},{"$f":"IF(L46=0,I39*J46,I39*J46*L46)","v":299.96999999999997}]
["TC",null,null,null,null,"M0355","Đầm dùi 1,5Kw","ca",null,8.8999999999999996E-2,230940,null,{"$f":"IF(L47=0,J47*K47,J47*K47*L47)","v":20553.66},{"$f":"IF(L47=0,I39*J47,I39*J47*L47)","v":889.91099999999994}]
[{"$f":"'Du toan XD'!A16","v":5},{"$f":"'Du toan XD'!B16","v":2},"C2223","AF.21220","AF.21223",null,{"$f":"'Du toan XD'!F16","v":"Bê tông sản xuất qua dây chuyền trạm trộn tại hiện trường hoặc vữa bê tông thương phẩm từ các cơ sở sản xuất tập trung và đổ bằng cần cẩu, chiều rộng móng >250cm, bê tông móng, vữa bê tông đá 1x2 mác 200"},{"$f":"'Du toan XD'!G16","v":"m³"},{"$f":"'Du toan XD'!H16","v":9999},null,null,null,null,null,null,{"$f":"M49","v":705824.27162499994},null,{"$f":"M55","v":228991.44999999998},{"$f":"M57","v":75589.11}]
[null,null,null,null,null,null,"Vật liệu",null,null,{"$f":"Config!C36","v":1},null,null,{"$f":"SUM(M50:M54)*J49","v":705824.27162499994}]
[null,null,"C2223",null,null,"C2223","Vữa bê tông M200, XM PC30, cát vàng, đá 1x2, độ sụt 6 - 8cm","m3",null,1.0249999999999999,648496.5,null,{"$f":"IF(L50=0,J50*K50,J50*K50*L50)","v":664708.91249999998},{"$f":"IF(L50=0,I48*J50,I48*J50*L50)","v":10248.974999999999},{"$f":"J54%*N50","v":102.48974999999999}]
[null,null,null,null,null,"V10449","Gỗ ván cầu công tác","m³",null,1.4999999999999999E-2,2000000,null,{"$f":"IF(L51=0,J51*K51,J51*K51*L51)","v":30000},{"$f":"IF(L51=0,I48*J51,I48*J51*L51)","v":149.98499999999999},{"$f":"J54%*N51","v":1.4998499999999999}]
[null,null,null,null,null,"V10329","Đinh","kg",null,0.122,19000,null,{"$f":"IF(L52=0,J52*K52,J52*K52*L52)","v":2318},{"$f":"IF(L52=0,I48*J52,I48*J52*L52)","v":1219.8779999999999},{"$f":"J54%*N52","v":12.198779999999999}]
[null,null,null,null,null,"V10334","Đinh đỉa","cái",null,0.60299999999999998,3000,null,{"$f":"IF(L53=0,J53*K53,J53*K53*L53)","v":1809},{"$f":"IF(L53=0,I48*J53,I48*J53*L53)","v":6029.3969999999999},{"$f":"J54%*N53","v":60.293970000000002}]
[null,null,null,null,null,"V19999","Vật liệu khác","%",null,1,null,null,{"$f":"SUM(M50:M53)*J54%","v":6988.3591249999999},null,{"$f":"J54%*N54","v":0}]
[null,null,null,null,null,null,"Nhân công",null,null,{"$f":"Config!C37","v":1},null,null,{"$f":"SUM(M56:M56)*J55","v":228991.44999999998},null,{"$f":"J54%*N55","v":0}]
[null,null,null,null,null,"N1307","Nhân công 3,0/7 (nhóm 1)","công",null,1.1499999999999999,199123,null,{"$f":"IF(L56=0,J56*K56,J56*K56*L56)","v":228991.44999999998},{"$f":"IF(L56=0,I48*J56,I48*J56*L56)","v":11498.849999999999},{"$f":"J54%*N56","v":114.98849999999999}]
[null,null,null,null,null,null,"Máy thi công",null,null,{"$f":"Config!C38","v":1},null,null,{"$f":"SUM(M58:M59)*J57","v":75589.11}]
[null,null,null,null,null,"M0224","Cần trục bánh xích 10 tấn","ca",null,0.03,1834515,null,{"$f":"IF(L58=0,J58*K58,J58*K58*L58)","v":55035.45},{"$f":"IF(L58=0,I48*J58,I48*J58*L58)","v":299.96999999999997}]
["TC",null,null,null,null,"M0355","Đầm dùi 1,5Kw","ca",null,8.8999999999999996E-2,230940,null,{"$f":"IF(L59=0,J59*K59,J59*K59*L59)","v":20553.66},{"$f":"IF(L59=0,I48*J59,I48*J59*L59)","v":889.91099999999994}]
[{"$f":"'Du toan XD'!A17","v":6},{"$f":"'Du toan XD'!B17","v":3},"C2232","AF.21210","AF.21232",null,{"$f":"'Du toan XD'!F17","v":"Bê tông sản xuất qua dây chuyền trạm trộn tại hiện trường hoặc vữa bê tông thương phẩm từ các cơ sở sản xuất tập trung và đổ bằng cần cẩu, chiều rộng móng ≤250cm, bê tông móng, vữa bê tông đá 2x4 mác 150"},{"$f":"'Du toan XD'!G17","v":"m³"},{"$f":"'Du toan XD'!H17","v":9999},null,null,null,null,null,null,{"$f":"M61","v":585567.93987499992},null,{"$f":"M64","v":177219.47},{"$f":"M66","v":75589.11}]
[null,null,null,null,null,null,"Vật liệu",null,null,{"$f":"Config!C36","v":1},null,null,{"$f":"SUM(M62:M63)*J61","v":585567.93987499992}]
[null,null,"C2232",null,null,"C2232","Vữa bê tông M150, XM PC30, cát vàng, đá 2x4, độ sụt 6 - 8cm","m3",null,1.0249999999999999,565629.5,null,{"$f":"IF(L62=0,J62*K62,J62*K62*L62)","v":579770.23749999993},{"$f":"IF(L62=0,I60*J62,I60*J62*L62)","v":10248.974999999999},{"$f":"J63%*N62","v":102.48974999999999}]
[null,null,null,null,null,"V19999","Vật liệu khác","%",null,1,null,null,{"$f":"SUM(M62:M62)*J63%","v":5797.7023749999998},null,{"$f":"J63%*N63","v":0}]
[null,null,null,null,null,null,"Nhân công",null,null,{"$f":"Config!C37","v":1},null,null,{"$f":"SUM(M65:M65)*J64","v":177219.47},null,{"$f":"J63%*N64","v":0}]
[null,null,null,null,null,"N1307","Nhân công 3,0/7 (nhóm 1)","công",null,0.89,199123,null,{"$f":"IF(L65=0,J65*K65,J65*K65*L65)","v":177219.47},{"$f":"IF(L65=0,I60*J65,I60*J65*L65)","v":8899.11},{"$f":"J63%*N65","v":88.991100000000003}]
[null,null,null,null,null,null,"Máy thi công",null,null,{"$f":"Config!C38","v":1},null,null,{"$f":"SUM(M67:M68)*J66","v":75589.11}]
[null,null,null,null,null,"M0224","Cần trục bánh xích 10 tấn","ca",null,0.03,1834515,null,{"$f":"IF(L67=0,J67*K67,J67*K67*L67)","v":55035.45},{"$f":"IF(L67=0,I60*J67,I60*J67*L67)","v":299.96999999999997}]
["TC",null,null,null,null,"M0355","Đầm dùi 1,5Kw","ca",null,8.8999999999999996E-2,230940,null,{"$f":"IF(L68=0,J68*K68,J68*K68*L68)","v":20553.66},{"$f":"IF(L68=0,I60*J68,I60*J68*L68)","v":889.91099999999994}]

{"sheet":"TH vat tu XD","index":22,"n_rows":6,"n_cols":16,"rows_kept":6,"cut":false,"hidden":false,"merged":[]}
["BẢNG TỔNG HỢP VÀ TÍNH CHÊNH LỆCH VẬT TƯ XÂY DỰNG"]
[{"$f":"Bia!D42&Bia!E42","v":"CÔNG TRÌNH: CÁC PHẦN MỀM QUẢN LÝ CHI PHÍ ĐTXD CT"}]
[{"$f":"Bia!D43&Bia!E43","v":"HẠNG MỤC: PHẦN MỀM DỰ TOÁN GXD 10"}]
[null,null,null,null,null,null,null,null,"ĐVT: đồng","ĐVT: đồng"]
["STT","MSVT","TÊN VẬT TƯ","ĐƠN VỊ","KHỐI LƯỢNG","GIÁ VẬT TƯ GỐC","GIÁ VẬT TƯ TẠI THỜI ĐIỂM LẬP DỰ TOÁN","CHÊNH LỆCH","THÀNH TIỀN","THÀNH TIỀN","TỶ TRỌNG VẬT TƯ TRONG VL, NC, MTC","TỶ TRỌNG TRONG CP TRỰC TIẾP","NGUỒN","KL vật tư khác","Chênh lệch vật tư khác","Thành tiền vật tư khác"]
["[1]","[2]","[3]","[4]","[5]","[6]","[7]","[8]=[7]-[6]","[9]=[5]*[8]","[7]=[5]*[6]","[8]","[9]","[10]","[11]","[12]","[13]"]

{"sheet":"Thong ke thep","index":23,"n_rows":14,"n_cols":32,"rows_kept":14,"cut":false,"hidden":false,"merged":[[4,7,5,7],[4,10,4,11],[4,12,4,13],[4,14,5,14],[4,1,5,1],[4,2,5,2],[4,8,5,8],[4,9,5,9],[4,3,5,5],[4,6,5,6]]}
[null,"BẢNG THỐNG KÊ CỐT THÉP",null,null,null,null,null,null,null,null,null,null,null,null,null,null,"ĐK (mm)",6,8,10,12,14,16,18,20,22,24,26,26,28,30,32]
[null,{"$f":"Bia!D42&Bia!E42","v":"CÔNG TRÌNH: CÁC PHẦN MỀM QUẢN LÝ CHI PHÍ ĐTXD CT"},null,null,null,null,null,null,null,null,null,null,null,null,null,null,"TL (kg/m)",{"$f":"ROUND(PI()*(R1/1000)^2/4*1*$R$3,3)","v":0.222},0.39500000000000002,0.61699999999999999,0.88800000000000001,1.208,1.5780000000000001,1.998,2.4660000000000002,2.984,3.5510000000000002,4.1680000000000001,4.1680000000000001,4.8339999999999996,5.5490000000000004,{"$f":"ROUND(PI()*(AF1/1000)^2/4*1*$R$3,3)","v":6.3129999999999997}]
[null,{"$f":"Bia!D43&Bia!E43","v":"HẠNG MỤC: PHẦN MỀM DỰ TOÁN GXD 10"},null,null,null,null,null,null,null,null,null,null,null,null,null,null,null,7850,"kg/m3"]
[]
[null,"CẤU KIỆN","Số hiệu thanh","HÌNH DẠNG - KÍCH THƯỚC",null,null,"Số lượng mối nối","Chiều dài mối nối","Đ.kính\nΦ (mm)","Số cấu kiện","1 cấu kiện",null,"Toàn bộ",null,"Tổng trọng lượng (kg)"]
[null,null,null,null,null,null,null,null,null,null,"Số thanh","Chiều dài (m)","Số thanh","Chiều dài (m)"]
[]
[null,"M1",1,null,null,null,null,null,6,4,4,{"$f":"(D8+E8+F8+G8*H8)/1000","v":0},{"$f":"J8*K8","v":16},{"$f":"L8*M8","v":0},{"$f":"ROUND(HLOOKUP(I8,$R$1:$AW$2,2,0)*N8,0)","v":0}]
[null,null,2,null,null,null,null,null,18,{"$f":"J8","v":4},4,{"$f":"(D9+E9+F9+G9*H9)/1000","v":0},{"$f":"J9*K9","v":16},{"$f":"L9*M9","v":0},{"$f":"ROUND(HLOOKUP(I9,$R$1:$AW$2,2,0)*N9,0)","v":0}]
[null,null,3,null,null,null,null,null,22,{"$f":"J9","v":4},2,{"$f":"(D10+E10+F10+G10*H10)/1000","v":0},{"$f":"J10*K10","v":8},{"$f":"L10*M10","v":0},{"$f":"ROUND(HLOOKUP(I10,$R$1:$AW$2,2,0)*N10,0)","v":0}]
[null,null,"…"]
[null,null,null,null,null,null,null,null,10,null,null,null,null,null,{"$f":"SUMIF(I8:I11,\"<11\",O8:O11)","v":0}]
[null,null,null,null,"Tổng cộng",null,null,null,18,null,null,null,null,null,{"$f":"SUM(O8:O11)-O12-O14","v":0}]
[null,null,null,null,null,null,null,null,18,null,null,null,null,null,{"$f":"SUMIF(I8:I11,\">18\",O8:O11)","v":0}]

{"sheet":"Gia vua XD","index":24,"n_rows":6,"n_cols":8,"rows_kept":6,"cut":false,"hidden":true,"merged":[]}
["BẢNG GIÁ VỮA THI CÔNG XÂY DỰNG"]
[{"$f":"Bia!D42&Bia!E42","v":"CÔNG TRÌNH: CÁC PHẦN MỀM QUẢN LÝ CHI PHÍ ĐTXD CT"}]
[{"$f":"Bia!D43&Bia!E43","v":"HẠNG MỤC: PHẦN MỀM DỰ TOÁN GXD 10"}]
[null,null,null,null,null,null,null,"ĐVT: đồng"]
["STT","MÃ VỮA","MSVT","LOẠI VẬT LIỆU","ĐƠN VỊ","ĐỊNH MỨC","ĐƠN GIÁ","THÀNH TIỀN"]
["[1]","[2]","[3]","[4]","[5]","[6]","[7]","[8]=[6]*[7]"]

{"sheet":"Gia vat lieu HTXD","index":25,"n_rows":7,"n_cols":30,"rows_kept":7,"cut":false,"hidden":true,"merged":[[4,11,5,11],[4,7,5,7],[4,29,5,29],[4,9,5,9],[4,20,5,20],[4,12,5,12],[4,19,5,19],[4,8,5,8],[4,10,5,10],[4,6,5,6],[4,4,5,4],[4,0,5,0],[4,1,5,1],[4,2,5,2],[4,3,5,3],[4,5,5,5]]}
["BẢNG TÍNH GIÁ VẬT LIỆU ĐẾN HIỆN TRƯỜNG XÂY DỰNG"]
[{"$f":"Bia!D42&Bia!E42","v":"CÔNG TRÌNH: CÁC PHẦN MỀM QUẢN LÝ CHI PHÍ ĐTXD CT"}]
[{"$f":"Bia!D43&Bia!E43","v":"HẠNG MỤC: PHẦN MỀM DỰ TOÁN GXD 10"}]
["Bốc xếp, vận chuyển nội bộ lấy NC nhóm 1, bậc 3/7:",null,null,null,null,{"$f":"_Nii3","v":0},"đồng/ công",null,null,null,null,null,null,null,null,null,null,null,null,null,null,null,null,null,null,null,null,null,null,"ĐVT: đồng"]
["STT","MSVT","LOẠI VẬT LIỆU","ĐƠN VỊ","TRỌNG LƯỢNG ĐƠN VỊ","NGUỒN MUA","PHƯƠNG TIỆN VẬN CHUYỂN","GIÁ VẬT LIỆU TẠI NGUỒN CUNG CẤP","LOẠI ĐƯỜNG","CỰ LY (Km)","GIÁ CƯỚC","HỆ SỐ BẬC HÀNG","HỆ SỐ ĐỔ BEN","CHI PHÍ TRUNG CHUYỂN (nếu có)",null,null,null,"CP HAO HỤT VẬN CHUYỂN",null,"CHI PHÍ LƯU THÔNG KHÁC (nếu có)","GIÁ VẬT LIỆU ĐẾN CÔNG TRÌNH","CP BỐC XẾP (nếu có)",null,"CP VẬN CHUYỂN NỘI BỘ CT (nếu có)",null,null,null,"CP HAO HỤT BẢO QUẢN",null,"GIÁ VẬT LiỆU ĐẾN HIỆN TRƯỜNG CÔNG TRÌNH"]
[null,"MÃ HIỆU",null,null,null,null,null,null,null,null,null,null,null,"Định mức bốc xếp","Thành tiền bốc xếp","Định mức hao hụt ","Thành tiền","Định mức hao hụt","Thành tiền",null,null,"Định mức bốc xếp","Thành tiền bốc xếp","ĐMVC 10 m khởi điểm","Cự ly vận chuyển nội bộ công trình","ĐMVC 10 m tiếp theo","Chi phí VC trong nội bộ công trình","Định mức hao hụt bảo quản tại hiện trường","Thành tiền"]
["[1]","[2]","[3]","[4]","[5]","[6]","[7]","[8]","[8]","[9]","[10]","[11]","[12]","[13]","[14]","[15]","[16]","[17]","[18]","[19]","[20]","[21]","[22]","[23]","[24]","[25]","[26]","[27]","[28]","[29]"]

{"sheet":"Nhan cong XD","index":26,"n_rows":15,"n_cols":14,"rows_kept":15,"cut":false,"hidden":true,"merged":[[12,0,13,0],[12,1,13,1],[12,3,13,3],[12,4,13,4],[12,2,13,2],[6,3,6,4],[7,3,7,4],[8,3,8,4],[12,13,13,13],[12,5,13,5],[12,6,13,6]]}
["BẢNG ĐƠN GIÁ NHÂN CÔNG XÂY DỰNG"]
[{"$f":"Bia!D42&Bia!E42","v":"CÔNG TRÌNH: CÁC PHẦN MỀM QUẢN LÝ CHI PHÍ ĐTXD CT"}]
[]
[" - Mức lương tối thiểu chung (LTTC):",null,null,null,null,{"$f":"LTTC","v":1050000},"đồng/tháng"]
[" - Mức lương tối thiểu vùng (LTTV):",null,null,null,null,{"$f":"LTTV","v":2000000},"đồng/tháng"]
[" - Các khoản phụ cấp theo LTT:"]
[null,"Phụ cấp lưu động:",null,{"$f":"PC_LD*100&\"%*LTTC\"","v":"20%*LTTC"},null,{"$f":"LTTC*PC_LD","v":210000},"đồng/tháng"]
[null,"Phụ cấp khu vực:",null,{"$f":"PC_KV*100&\"%*LTTC\"","v":"0%*LTTC"},null,{"$f":"LTTC*PC_KV","v":0},"đồng/tháng"]
[null,"Phụ cấp độc hại:",null,{"$f":"PC_DH*100&\"%*LTTC\"","v":"0%*LTTC"},null,{"$f":"LTTC*PC_DH","v":0},"đồng/tháng"]
[null,"Tổng các phụ cấp theo LTT:",null,null,null,{"$f":"SUM(F7:F9)","v":210000},"đồng/tháng"]
["   - Mức lương đầu vào sử dụng để xác định đơn giá nhân công (LNC):",null,null,null,null,null,null,null,null,null,null,null,null,{"$f":"LNC_dauvao","v":0}]
[]
["STT","MSVT","LOẠI NHÂN CÔNG","CẤP BẬC","HỆ SỐ LƯƠNG HCB","LƯƠNG CẤP BẬC\nLCB (đ/tháng)","TỔNG CÁC KHOẢN PHỤ CẤP THEO LTT","CÁC KHOẢN PHỤC CẤP THEO LƯƠNG CB",null,null,null,null,null,"ĐƠN GIÁ NHÂN CÔNG\nGNC (đ/công)"]
[null,null,null,null,null,null,null,"Lương phụ","Khoán trực tiếp","Không ổn định SX","Thu hút","Đặc biệt","Ca đêm"]
["[1]","[2]","[3]","[4]","[5]",{"$f":"IF(CF_TDNCXD=0,\"[6]= [5] x LNC\",\"[6]= [5] x LTTV\")","v":"[6]= [5] x LNC"},"[7]","[8]","[9]","[10]","[11]","[12]","[13]",{"$f":"IF(CF_TDNCXD=0,\"[7]=[6]/ 26\",\"[14]=(LCB+P)/26\")","v":"[7]=[6]/ 26"}]

{"sheet":"Gia ca may XD","index":27,"n_rows":7,"n_cols":40,"rows_kept":7,"cut":false,"hidden":true,"merged":[[4,0,5,0],[4,1,5,1],[4,2,5,2],[4,3,5,3],[4,9,5,10],[4,5,4,8],[4,4,5,4],[4,35,5,35],[4,11,5,11],[4,14,5,14],[4,16,5,16],[4,17,5,17],[4,19,5,19],[4,31,5,31],[4,29,5,29],[4,26,5,26],[4,18,5,18],[4,15,5,15],[4,30,5,30],[4,13,5,13],[4,33,5,33],[4,12,5,12],[4,20,5,20],[4,34,5,34],[4,25,5,25],[4,22,4,24],[4,27,5,27],[4,21,5,21],[4,32,5,32],[4,28,5,28]]}
["BẢNG GIÁ CA MÁY VÀ THIẾT BỊ THI CÔNG XÂY DỰNG",null,null,null,null,null,null,null,null,null,null,null,null,null,null,null,null,null,null,null,null,null,null,null,null,null,null,null,null,null,null,null,null,null,null,null,null,"Xăng (đ/lít)","Diezel (đ/lít)","Điện (đ/kw)"]
[{"$f":"Bia!D42&Bia!E42","v":"CÔNG TRÌNH: CÁC PHẦN MỀM QUẢN LÝ CHI PHÍ ĐTXD CT"},null,null,null,null,null,null,null,null,null,null,null,null,null,null,null,null,null,null,null,null,null,null,null,null,null,null,null,null,null,null,null,null,null,null,null,"GNL gốc:",19909,19545,1622.01]
[{"$f":"Bia!D43&Bia!E43","v":"HẠNG MỤC: PHẦN MỀM DỰ TOÁN GXD 10"},null,null,null,null,null,null,null,null,null,null,null,null,null,null,null,null,null,null,null,null,null,null,null,null,null,null,null,null,null,null,null,null,null,null,null,"GNL hiện tại:",{"$f":"xang","v":19909},{"$f":"diezel","v":19545},{"$f":"dien","v":1622.01}]
[null,null,null,null,null,null,null,null,null,null,null,null,null,null,null,null,null,null,null,null,null,"ĐVT: đồng/ca",null,null,null,null,null,null,null,null,null,null,null,null,null,"ĐVT: đồng/ca","GNL chênh lệch:",{"$f":"AL3-AL2","v":0},{"$f":"AM3-AM2","v":0},{"$f":"AN3-AN2","v":0}]
["STT","MSVT","LOẠI MÁY, THIẾT BỊ","SỐ CA/ NĂM","HAO PHÍ CA MÁY","ĐỊNH MỨC KHẤU HAO, SỬA CHỮA, CHI PHÍ KHÁC / NĂM (%/GIÁ TÍNH KH)",null,null,null,"ĐỊNH MỨC TIÊU HAO NHIÊN LIỆU, NĂNG LƯỢNG 1 CA (CNL)",null,"HỆ SỐ NHIÊN LIỆU PHỤ","TỔNG HAO PHÍ NHIÊN LIỆU","CHÊNH LỆCH CHI PHÍ MTC DO CHÊNH LỆCH GIÁ NLNL","THÀNH PHẦN CẤP BẬC THỢ ĐIỀU KHIỂN MÁY","NGUYÊN GIÁ (GIÁ TÍNH KHẤU HAO)","CHI PHÍ KHẤU HAO\n(CKH)","CHI PHÍ SỬA CHỮA\n(CSC)","CHI PHÍ NHIÊN LIỆU, NĂNG LƯỢNG\n(CNL)","CHI PHÍ TIỀN LƯƠNG\n(CTL)","CHI PHÍ KHÁC\n(CCPK)","GIÁ CA MÁY\n(CCM)","CHI PHÍ TRONG GCM TẠI THỜI ĐIỂM GỐC",null,null,"CHI PHÍ NHIÊN LIỆU, NĂNG LƯỢNG TẠI THỜI ĐIỂM GỐC","CHI PHÍ TIỀN LƯƠNG TẠI THỜI ĐIỂM GỐC","NGUYÊN GIÁ (GIÁ TÍNH KHẤU HAO) TẠI THỜI ĐIỂM GỐC","NGUYÊN GIÁ (GIÁ TÍNH KHẤU HAO) TẠI THỜI ĐIỂM ĐIỀU CHỈNH","GIÁ CA MÁY GỐC","CHI PHÍ NHIỀN LIỆU, NĂNG LƯỢNG TẠI THỜI ĐIỂM ĐIỀU CHỈNH","CHI PHÍ TIỀN LƯƠNG TẠI THỜI ĐIỂM ĐIỀU CHỈNH","HỆ SỐ ĐIỀU CHỈNH NGUYÊN GIÁ (K1)","HỆ SỐ ĐIỀU CHỈNH CHI PHÍ NHIÊN LIỆU, NĂNG LƯỢNG (K2)","HỆ SỐ ĐIỀU CHỈNH CHI PHÍ TIỀN LƯƠNG (K3)","GIÁ CA MÁY ĐIỀU CHỈNH (CCMĐC)"]
[null,null,null,null,null,"Khấu hao","Hệ số thu hồi khi thanh lý","Sửa chữa","CP #",null,null,null,null,null,null,null,null,null,null,null,null,null,"CP khấu hao","CP sửa chữa","CP khác"]
["[1]","[2]","[3]","[4]",null,"[5]","[6]","[7]","[8]","[9]",null,"[10]",null,null,"[11]","[12]","[13]","[14]","[15]","[16]","[17]","[18]","[6]","[7]","[8]","[9]","[10]","[11]","[12]","[12]","[13]","[14]","[15]","[16]","[17]","[18]"]

{"sheet":"Du thau XD","index":28,"n_rows":6,"n_cols":19,"rows_kept":6,"cut":false,"hidden":true,"merged":[]}
["BẢNG DỰ TOÁN DỰ THẦU THI CÔNG XÂY DỰNG"]
[{"$f":"Bia!D42&Bia!E42","v":"CÔNG TRÌNH: CÁC PHẦN MỀM QUẢN LÝ CHI PHÍ ĐTXD CT"}]
[{"$f":"Bia!D43&Bia!E43","v":"HẠNG MỤC: PHẦN MỀM DỰ TOÁN GXD 10"}]
[]
["STT","MÃ HIỆU","NỘI DUNG CÔNG VIỆC","ĐƠN VỊ","KHỐI LƯỢNG","ĐƠN GIÁ","THÀNH TIỀN","ĐGVL","ĐGVLP","ĐGNC","ĐGM","TT","T","C","TL","G","GTGT","GXDNT","GXD"]
["[1]","[2]","[3]","[4]","[5]","[6]","[7]=[5]*[6]"]

{"sheet":"Bia2","index":29,"n_rows":45,"n_cols":14,"rows_kept":45,"cut":false,"hidden":true,"merged":[[15,4,15,7]]}
[]
["CÔNG TY CP GIÁ XÂY DỰNG",null,null,null,null,"CỘNG HÒA XÃ HỘI CHỦ NGHĨA VIỆT NAM"]
["WWW.GIAXAYDUNG.VN",null,null,null,null,"Độc lập - Tự do - Hạnh phúc"]
[]
["          Số : ……./………."]
[]
[]
[]
["DỰ TOÁN CHI PHÍ THIẾT BỊ"]
[]
[null,null,null,"DỰ ÁN:",{"$f":"Bia!E11","v":"HỆ THỐNG PHẦN MỀM CHUYÊN NGÀNH XÂY DỰNG - GXD"}]
[null,null,null,"CÔNG TRÌNH:",{"$f":"UPPER(Ts!K6)","v":"CÁC PHẦN MỀM QUẢN LÝ CHI PHÍ ĐTXD CT"}]
[null,null,null,"ĐỊA ĐIỂM:",{"$f":"UPPER(Ts!K10)","v":"SỐ 2A/55 NGUYỄN NGỌC NẠI, THANH XUÂN, HÀ NỘI"}]
[null,null,null,"CHỦ ĐẦU TƯ:",{"$f":"UPPER(Ts!K12)","v":"CÔNG TY CỔ PHẦN GIÁ XÂY DỰNG"}]
[]
[null,null,null,"Giá trị dự toán:",{"$f":"'THCP thiet bi'!F13","v":0},null,null,null,"đồng"]
[null,null,null,{"$f":"\"(Bằng chữ: \"&vnd(E16)&\")\"","v":"(Bằng chữ:  đồng.)"}]
[]
[]
[null,null,null,null,null,null,null,"Hà Nội, ","ngày",{"$f":"NOW()","v":"2016-04-11T17:22:51.280"},"tháng",{"$f":"NOW()","v":"2016-04-11T17:22:51.280"},"năm",{"$f":"NOW()","v":"2016-04-11T17:22:51.280"}]
[null,null,null,null,null,null,null,null,"GIÁM ĐỐC"]
[]
[]
[]
[]
[]
[null,null,null,null,null,null,null,null,"NGUYỄN THÀNH CÔNG"]
[]
[]
["CÔNG TY CP GIÁ XÂY DỰNG",null,null,null,null,"CỘNG HOÀ XÃ HỘI CHỦ NGHĨA VIỆT NAM"]
["WWW.GIAXAYDUNG.VN",null,null,null,null,"Độc lập - Tự do - Hạnh phúc"]
[]
[]
[]
[]
[]
[]
[]
["DỰ TOÁN LẮP ĐẶT THIẾT BỊ"]
["Số : ……./……."]
[]
[null,null,null,"CÔNG TRÌNH: ",{"$f":"IF(Ts!K6=\"\",\"\",UPPER(Ts!K6))","v":"CÁC PHẦN MỀM QUẢN LÝ CHI PHÍ ĐTXD CT"}]
[null,null,null,"HẠNG MỤC: ",{"$f":"IF(Ts!K8=\"\",\"\",UPPER(Ts!K8))","v":"PHẦN MỀM DỰ TOÁN GXD 10"}]
[null,null,null,"ĐỊA ĐIỂM:",{"$f":"UPPER(Ts!K10)","v":"SỐ 2A/55 NGUYỄN NGỌC NẠI, THANH XUÂN, HÀ NỘI"}]
[null,null,null,"CHỦ ĐẦU TƯ:",{"$f":"UPPER(Ts!K12)","v":"CÔNG TY CỔ PHẦN GIÁ XÂY DỰNG"}]

{"sheet":"THDT goi thau TB","index":30,"n_rows":27,"n_cols":7,"rows_kept":27,"cut":false,"hidden":true,"merged":[]}
["BẢNG DỰ TOÁN GÓI THẦU MUA SẮM VẬT TƯ, THIẾT BỊ\n LẮP ĐẶT VÀO CÔNG TRÌNH"]
[{"$f":"Bia!D42&Bia!E42","v":"CÔNG TRÌNH: CÁC PHẦN MỀM QUẢN LÝ CHI PHÍ ĐTXD CT"}]
[null,null,null,null,"ĐVT: đồng"]
["STT","HẠNG MỤC","GIÁ TRỊ TRƯỚC THUẾ","THUẾ GTGT","GIÁ TRỊ SAU THUẾ","KÝ HIỆU","ĐMTL"]
["[1]","[2]","[3]","[4]","[5]","[6]"]
[1,"Chi phí mua sắm thiết bị",{"$f":"'CP mua sam TB'!G12","v":0},{"$f":"'CP mua sam TB'!H12","v":0},{"$f":"'CP mua sam TB'!I12","v":0}]
[2,"Chi phí đào tạo và chuyển giao công nghệ",{"$f":"'CP dao tao'!F22","v":0},{"$f":"'CP dao tao'!G22","v":0},{"$f":"'CP dao tao'!H22","v":0}]
[3,"Chi phí lắp đặt, thí nghiệm, hiệu chỉnh",{"$f":"THLD_G","v":0},{"$f":"THLD_GTGT","v":0},{"$f":"THLD_GLD","v":0}]
[4,"Chi phí hạng mục chung",{"$f":"SUM(C10:C12)","v":0},{"$f":"SUM(D10:D12)","v":0},{"$f":"SUM(E10:E12)","v":0},"CHMC"]
["4.1","Chi phí xây dựng nhà tạm tại hiện trường để ở và điều hành thi công",{"$f":"C8*$G$10","v":0},{"$f":"D8*$G$10","v":0},{"$f":"E8*$G$10","v":0},"CNT",{"$f":"'CP HMC'!D20","v":0.01}]
["4.2","Chi phí một số công tác không xác định được khối lượng từ thiết kế",{"$f":"C8*$G$11","v":0},{"$f":"D8*$G$11","v":0},{"$f":"E8*$G$11","v":0},"CKKL",{"$f":"'CP HMC'!D21","v":2.5000000000000001E-2}]
["4.3","Các chi phí hạng mục chung khác",{"$f":"SUM(C13:C15)","v":0},{"$f":"SUM(D13:D15)","v":0},{"$f":"SUM(E13:E15)","v":0},"CK"]
[null,"Chi phí di chuyển thiết bị thi công và lực lượng lao động đến công trường"]
[null,"Chi phí đảm bảo an toàn giao thông phục vụ thi công"]
[null,"…"]
[5,"Chi phí dự phòng",{"$f":"SUM(C17:C18)","v":0},{"$f":"SUM(D17:D18)","v":0},{"$f":"SUM(E17:E18)","v":0},"GDPTB"]
[null,"Chi phí dự phòng cho yếu tố khối lượng phát sinh",{"$f":"SUM(C6:C8,C9)*$G$17","v":0},{"$f":"SUM(D6:D8,D9)*$G$17","v":0},{"$f":"SUM(E6:E8,E9)*$G$17","v":0},"GDPTB1",{"$f":"'CP Du phong'!E114","v":0.05}]
[null,"Chi phí dự phòng cho yếu tố trượt giá",{"$f":"SUM(C6:C8,C9)*$G$18","v":0},{"$f":"SUM(D6:D8,D9)*$G$18","v":0},{"$f":"SUM(E6:E8,E9)*$G$18","v":0},"GDPTB2",{"$f":"IF('CP Du phong'!D149=0,0,'CP Du phong'!D149-'THDT goi thau TB'!G17)","v":0}]
[null,"TỔNG CỘNG (1+2+3+4+5)",null,null,{"$f":"SUM(E6,E7,E8,E9,E16)","v":0},"GGTTB",{"$f":"SUM(G6:G6)","v":0}]
[]
[null,{"$f":"\"(Bằng chữ: \"&vnd(E19)&\")\"","v":"(Bằng chữ:  đồng.)"}]
[]
["NGƯỜI LẬP",null,null,"NGƯỜI CHỦ TRÌ"]
[]
[]
[]
[null,null,null,"Chứng chỉ hành nghề định giá XD hạng …, số …               "]

{"sheet":"THCP thiet bi","index":31,"n_rows":19,"n_cols":6,"rows_kept":19,"cut":false,"hidden":true,"merged":[]}
["BẢNG TỔNG HỢP DỰ TOÁN CHI PHÍ THIẾT BỊ"]
[{"$f":"Bia!D42&Bia!E42","v":"CÔNG TRÌNH: CÁC PHẦN MỀM QUẢN LÝ CHI PHÍ ĐTXD CT"}]
[{"$f":"'Bia2'!D43&'Bia2'!E43","v":"HẠNG MỤC: PHẦN MỀM DỰ TOÁN GXD 10"}]
[null,null,null,null,null,"ĐVT: đồng"]
["STT","TÊN THIẾT BỊ HAY NHÓM THIẾT BỊ","CÁCH TÍNH","CHI PHÍ TRƯỚC THUẾ","THUẾ GTGT","CHI PHÍ SAU THUẾ"]
[]
[1,"Chi phí mua sắm thiết bị (Gmstb)","bảng tính",{"$f":"'CP mua sam TB'!G12","v":0},{"$f":"'CP mua sam TB'!H12","v":0},{"$f":"'CP mua sam TB'!I12","v":0}]
[2,"Chi phí đào tạo và chuyển giao công nghệ (Gdtcg)","bảng tính",{"$f":"'CP dao tao'!F22","v":0},{"$f":"'CP dao tao'!G22","v":0},{"$f":"'CP dao tao'!H22","v":0}]
[3,"Chi phí lắp đặt, thí nghiệm, hiệu chỉnh (Gld)",null,{"$f":"THLD_G","v":0},{"$f":"THLD_GTGT","v":0},{"$f":"THLD_GLD","v":0}]
[4,"Chi phí khác có liên quan","bảng tính"]
[]
[null,"Tổng cộng:","(1)+(2)+...+(5)",{"$f":"D7+D8+D9+D10","v":0},{"$f":"E7+E8+E9+E10","v":0},{"$f":"F7+F8+F9+F10","v":0}]
[null,"LÀM TRÒN (GTB)",null,{"$f":"ROUND(D12,-3)","v":0},{"$f":"ROUND(E12,-3)","v":0},{"$f":"SUM(D13:E13)","v":0}]
[]
[null,"NGƯỜI LẬP","NGƯỜI CHỦ TRÌ"]
[]
[]
[]
[null,null,"Chứng chỉ hành nghề định giá XD hạng …, số …               "]

{"sheet":"CP mua sam TB","index":32,"n_rows":18,"n_cols":16,"rows_kept":18,"cut":false,"hidden":true,"merged":[]}
[null,"BẢNG DỰ TOÁN CHI PHÍ MUA SẮM THIẾT BỊ"]
[null,{"$f":"Bia!D42&Bia!E42","v":"CÔNG TRÌNH: CÁC PHẦN MỀM QUẢN LÝ CHI PHÍ ĐTXD CT"}]
[null,{"$f":"'Bia2'!D43&'Bia2'!E43","v":"HẠNG MỤC: PHẦN MỀM DỰ TOÁN GXD 10"}]
[null,null,null,null,null,null,null,null,"ĐVT: đồng"]
["Tra thiết bị","STT","TÊN THIẾT BỊ HAY NHÓM THIẾT BỊ","ĐƠN VỊ TÍNH","KHỐI LƯỢNG","ĐƠN GIÁ\nTRƯỚC THUẾ","THÀNH TIỀN\nTRƯỚC THUẾ","THUẾ GTGT","THÀNH TIỀN\nSAU THUẾ","THUẾ SUẤT","CHỦNG LOẠI","XUẤT XỨ","NHÀ SẢN XUẤT","NHÀ CUNG CẤP","NGUỒN","GHI CHÚ"]
[null,null,null,null,null,null,null,null,null,0.1]
[null,null,null,null,null,null,{"$f":"E7*F7","v":0},{"$f":"G7*J7","v":0},{"$f":"G7+H7","v":0},0.1]
[null,null,null,null,null,null,{"$f":"E8*F8","v":0},{"$f":"G8*J8","v":0},{"$f":"G8+H8","v":0},0.1]
[null,null,null,null,null,null,{"$f":"E9*F9","v":0},{"$f":"G9*J9","v":0},{"$f":"G9+H9","v":0},0.1]
[null,null,null,null,null,null,{"$f":"E10*F10","v":0},{"$f":"G10*J10","v":0},{"$f":"G10+H10","v":0},0.1]
[null,null,"Cộng chi phí mua sắm thiết bị (Gmstb)",null,null,null,{"$f":"SUM(G6:G10)","v":0},{"$f":"SUM(H6:H10)","v":0},{"$f":"SUM(I6:I10)","v":0}]
[null,null,"LÀM TRÒN (GTB)",null,null,null,{"$f":"ROUND(G11,-3)","v":0},{"$f":"ROUND(H11,-3)","v":0},{"$f":"SUM(G12:H12)","v":0}]
[]
[null,null,"NGƯỜI LẬP",null,"NGƯỜI CHỦ TRÌ"]
[]
[]
[]
[null,null,null,null,"Chứng chỉ KS định giá XD hạng …, số …"]

{"sheet":"CP dao tao","index":33,"n_rows":22,"n_cols":9,"rows_kept":22,"cut":false,"hidden":true,"merged":[]}
["BẢNG TỔNG HỢP CHI PHÍ ĐÀO TẠO CHUYỂN GIAO CÔNG NGHỆ"]
[{"$f":"Bia!D42&Bia!E42","v":"CÔNG TRÌNH: CÁC PHẦN MỀM QUẢN LÝ CHI PHÍ ĐTXD CT"}]
[{"$f":"'Bia2'!D43&'Bia2'!E43","v":"HẠNG MỤC: PHẦN MỀM DỰ TOÁN GXD 10"}]
[null,null,null,null,null,null,null,"ĐVT: đồng"]
["STT","NỘI DUNG CHI PHÍ","ĐVT","KHỐI LƯỢNG","ĐƠN GIÁ\nTRƯỚC THUẾ","CHI PHÍ TRƯỚC THUẾ","THUẾ GTGT","CHI PHÍ SAU THUẾ","THUẾ SUẤT"]
[]
["I","Chi phí trực tiếp",null,null,null,{"$f":"SUM(F8,F12,F13:F16)","v":0},{"$f":"SUM(G8,G12,G13:G16)","v":0},{"$f":"SUM(H8,H12,H13:H16)","v":0}]
[1,"Chi phí đi lại",null,null,null,{"$f":"SUM(F9:F11)","v":0},{"$f":"SUM(G9:G11)","v":0},{"$f":"SUM(H9:H11)","v":0}]
[null," - Taxi",null,null,null,{"$f":"D9*E9","v":0},{"$f":"F9*I9","v":0},{"$f":"F9+G9","v":0},0.1]
[null," - Máy bay",null,null,null,{"$f":"D10*E10","v":0},0,0,0.1]
[null," - Tàu",null,null,null,0,0,0,0.1]
[2,"Chi phí ăn, ở",null,null,null,0,0,0,0.1]
[3,"Chi phí đào tạo",null,null,null,0,0,0,0]
[4,"Chi phí tài liệu học tập",null,null,null,0,0,0,0.1]
[5,"Chi phí chuyên gia giảng dạy",null,null,null,0,0,0,0.1]
[null,"...",null,null,null,null,0,0,0.1]
["II","Chi phí khác",null,null,null,0,0,0,0.1]
["III","Chi phí chung, chi phí quản lý",null,null,null,0,0,0,0.1]
["IV","Chi phí dự phòng",null,null,null,0,0,0,0.1]
[]
[null,"Tổng cộng [I + II + ... + III]:",null,null,null,{"$f":"F7+F17+F18+F19","v":0},{"$f":"G7+G17+G18+G19","v":0},{"$f":"H7+H17+H18+H19","v":0}]
[null,"LÀM TRÒN (Gdtcg):",null,null,null,{"$f":"ROUND(F21,-3)","v":0},{"$f":"ROUND(G21,-3)","v":0},{"$f":"ROUND(H21,-3)","v":0}]

{"sheet":"THCP Lap dat","index":34,"n_rows":31,"n_cols":7,"rows_kept":31,"cut":false,"hidden":true,"merged":[]}
["BẢNG TỔNG HỢP DỰ TOÁN CHI PHÍ LẮP ĐẶT THIẾT BỊ"]
[{"$f":"Bia!D42&Bia!E42","v":"CÔNG TRÌNH: CÁC PHẦN MỀM QUẢN LÝ CHI PHÍ ĐTXD CT"}]
[{"$f":"'Bia2'!D43&'Bia2'!E43","v":"HẠNG MỤC: PHẦN MỀM DỰ TOÁN GXD 10"}]
[null,null,null,null,"ĐVT: đồng"]
["STT","KHOẢN MỤC CHI PHÍ","CÁCH TÍNH","GIÁ TRỊ","KÝ HIỆU","HS1","HS2"]
[null,"CHI PHÍ THEO ĐƠN GIÁ"]
[null,"Chi phí vật liệu",null,{"$f":"'Du toan LD'!M30+'Du toan LD'!N30","v":0},"A"]
[null,"Chênh lệch vật liệu",null,null,"CLVL"]
[null,"Chi phí nhân công",null,{"$f":"'Du toan LD'!O30","v":0},"B"]
[null,"Chênh lệch nhân công",null,null,"CLNC"]
[null,"Chi phí máy xây dựng",null,{"$f":"'Du toan LD'!P30","v":0},"C"]
[null,"Chênh lệch máy xây dựng",null,null,"CLM"]
["I","CHI PHÍ TRỰC TIẾP"]
[1,"Chi phí vật liệu",{"$f":"CPVLgld","v":"A*1"},{"$f":"IF(F14=0,D7+D8,(D7+D8)*F14)","v":0},"VL",{"$f":"ROUND(Ts!$O$51,3)","v":1}]
[2,"Chi phí nhân công",{"$f":"CPNCgld","v":"B*1"},{"$f":"PRODUCT(D9,F15:G15)+D10","v":0},"NC",{"$f":"ROUND(Ts!$O$52,4)","v":1}]
[3,"Chi phí máy thi công",{"$f":"CPMTCgld","v":"C*1"},{"$f":"PRODUCT(D11,F16:G16)+D12","v":0},"M",{"$f":"ROUND(Ts!$O$53,4)","v":1}]
[null,"Chi phí trực tiếp","VL+NC+M",{"$f":"THLD_VL+THLD_NC+THLD_M","v":0},"T"]
["II","CHI PHÍ CHUNG",{"$f":"\"T*\"&F18*100&\"%\"","v":"T*6,15158900155001%"},{"$f":"THLD_T*TPLD_hsCPC","v":0},"C",{"$f":"Ts!$O$54","v":6.1515890015500056E-2}]
["III","THU NHẬP CHỊU THUẾ TÍNH TRƯỚC",{"$f":"\"(T+C)*\"&F19*100&\"%\"","v":"(T+C)*5,5%"},{"$f":"(THLD_T+THLD_C)*THLD_hsTL","v":0},"TL",{"$f":"Ts!$O$55","v":5.5E-2}]
[null,"Chi phí lắp đặt thiết bị trước thuế","T+C+TL",{"$f":"THLD_T+THLD_C+THLD_TL","v":0},"G"]
["IV","THUẾ GIÁ TRỊ GIA TĂNG",{"$f":"\"G*\"&F21*100&\"%\"","v":"G*10%"},{"$f":"THLD_G*THLD_hsGTGT","v":0},"GTGT",{"$f":"Ts!$O$56","v":0.1}]
[null,"Chi phí lắp đặt thiết bị sau thuế","G+GTGT",{"$f":"THLD_G+THLD_GTGT","v":0},"GLD"]
[null,"Chi phí dự phòng",{"$f":"\"GLD*\"&F23*100&\"%\"","v":"GLD*0%"},{"$f":"THLD_GLD*THLD_hsCPDP","v":0},"GDP",{"$f":"'CP Du phong'!D$149","v":0}]
[null,"GIÁ DỰ THẦU","GLD+GDP",{"$f":"THLD_GLD+THLD_CPDP","v":0},"GGTLD"]
[]
[]
[null,"NGƯỜI LẬP","NGƯỜI CHỦ TRÌ"]
[]
[]
[]
[null,null,"Chứng chỉ hành nghề định giá XD hạng …, số …               "]

{"sheet":"Du toan LD","index":35,"n_rows":31,"n_cols":25,"rows_kept":31,"cut":false,"hidden":true,"merged":[[4,0,5,0],[4,1,5,1],[4,5,5,5],[4,6,5,6],[4,16,5,16],[4,23,5,23],[4,21,5,21],[4,2,5,2],[4,3,5,3],[4,4,5,4],[4,7,5,7],[4,22,5,22],[4,20,5,20]]}
[null,"BẢNG DỰ TOÁN CHI PHÍ LẮP ĐẶT THIẾT BỊ",null,null,null,null,null,null,null,null,null,null,null,null,null,null,null,null,null,null,null,null,null,null,">>>>>"]
[null,{"$f":"Bia!D42&Bia!E42","v":"CÔNG TRÌNH: CÁC PHẦN MỀM QUẢN LÝ CHI PHÍ ĐTXD CT"}]
[null,{"$f":"'Bia2'!D43&'Bia2'!E43","v":"HẠNG MỤC: PHẦN MỀM DỰ TOÁN GXD 10"}]
[null,null,null,null,null,null,null,null,null,null,null,null,null,null,null,"ĐVT: đồng"]
["ID","STT","MÃ VỮA","MÃ HIỆU ĐỊNH MỨC","MÃ HIỆU ĐƠN GIÁ","NỘI DUNG CÔNG VIỆC","ĐƠN VỊ","KHỐI LƯỢNG","ĐƠN GIÁ",null,null,null,"THÀNH TIỀN",null,null,null,"SỐ BỘ PHẬN GIỐNG NHAU","KÍCH THƯỚC",null,null,"HỆ SỐ","K.L MỘT BỘ PHẬN","K.L TOÀN BỘ PHẬN","GHI CHÚ"]
[null,null,null,null,null,null,null,null,"VẬT LIỆU","VẬT LIỆU P","NHÂN CÔNG","MÁY","VẬT LIỆU","VẬT LIỆU P","NHÂN CÔNG","MÁY",null,"DÀI","RỘNG","CAO (sâu)"]
["[1]","[1]","[1a]","[1b]","[2]","[3]","[4]","[5]","[6]","[6']","[7]","[8]","[9]=[5]*[6]","[9']=[5]*[6']","[10]=[5]*[7]","[11]=[5]*[8]","[5]","[6]","[6']","[7]","[8]","[9]","[10]","[11]"]
[]
[]
[]
[]
[]
[]
[]
[]
[]
[]
[]
[]
[]
[]
[]
[]
[]
[]
[]
[]
[]
[]
[null,null,null,null,"TC","Tổng cộng",null,null,null,null,null,null,{"$f":"SUM(M8:M29)","v":0},{"$f":"SUM(N8:N29)","v":0},{"$f":"SUM(O8:O29)","v":0},{"$f":"SUM(P8:X29)","v":0}]
[null,null,null,null,null,null,null,null,null,null,null,null,"A","Ap","B","C"]

{"sheet":"Don gia LD","index":36,"n_rows":6,"n_cols":19,"rows_kept":6,"cut":false,"hidden":true,"merged":[]}
[null,"BẢNG PHÂN TÍCH ĐƠN GIÁ CHI TIẾT LẮP ĐẶT THIẾT BỊ"]
[null,{"$f":"Bia!D42&Bia!E42","v":"CÔNG TRÌNH: CÁC PHẦN MỀM QUẢN LÝ CHI PHÍ ĐTXD CT"}]
[null,{"$f":"'Bia2'!D43&'Bia2'!E43","v":"HẠNG MỤC: PHẦN MỀM DỰ TOÁN GXD 10"}]
[null,null,null,null,null,null,null,null,null,null,null,null,"ĐVT: đồng"]
["ID","STT","MÃ VỮA","MÃ HiỆU ĐỊNH MỨC","MÃ HIỆU\nĐƠN GIÁ","MSVT","TÊN CÔNG VIỆC / THÀNH PHẦN HAO PHÍ","ĐƠN VỊ","KHỐI LƯỢNG","ĐỊNH MỨC\nHAO PHÍ","ĐƠN GIÁ","HỆ SỐ","THÀNH TIỀN","HAO PHÍ","HAO PHÍ KHÁC","ĐGVL","ĐGVLP","ĐGNC","ĐGM"]
[null,"[1]",null,null,"[2]","[3]","[4]","[5]","[6]","[7]","[8]","[9]","[10]","[11]","[12]"]

{"sheet":"TH vat tu LD","index":37,"n_rows":6,"n_cols":14,"rows_kept":6,"cut":false,"hidden":true,"merged":[]}
["BẢNG TỔNG HỢP VÀ TÍNH CHÊNH LỆCH VẬT TƯ LẮP ĐẶT THIẾT BỊ"]
[{"$f":"Bia!D42&Bia!E42","v":"CÔNG TRÌNH: CÁC PHẦN MỀM QUẢN LÝ CHI PHÍ ĐTXD CT"}]
[{"$f":"'Bia2'!D43&'Bia2'!E43","v":"HẠNG MỤC: PHẦN MỀM DỰ TOÁN GXD 10"}]
[null,null,null,null,null,null,null,null,"ĐVT: đồng"]
["STT","MSVT","TÊN VẬT TƯ","ĐƠN VỊ","KHỐI LƯỢNG","GIÁ VẬT TƯ GỐC","GIÁ VẬT TƯ TẠI THỜI ĐIỂM LẬP DỰ TOÁN","CHÊNH LỆCH","THÀNH TIỀN","THÀNH TIỀN","NGUỒN","KL vật tư khác","Chênh lệch vật tư khác","Thành tiền vật tư khác"]
["[1]","[2]","[3]","[4]","[5]","[6]","[7]","[8]=[7]-[6]","[9]=[5]*[8]","[7]=[5]*[6]","[10]","[11]","[12]","[10]"]

{"sheet":"Gia vua LD","index":38,"n_rows":6,"n_cols":8,"rows_kept":6,"cut":false,"hidden":true,"merged":[]}
["BẢNG GIÁ VỮA LẮP ĐẶT THIẾT BỊ"]
[{"$f":"Bia!D42&Bia!E42","v":"CÔNG TRÌNH: CÁC PHẦN MỀM QUẢN LÝ CHI PHÍ ĐTXD CT"}]
[{"$f":"'Bia2'!D43&'Bia2'!E43","v":"HẠNG MỤC: PHẦN MỀM DỰ TOÁN GXD 10"}]
[null,null,null,null,null,null,null,"ĐVT: đồng"]
["STT","MÃ VỮA","MSVT","LOẠI VẬT LIỆU","ĐƠN VỊ","ĐỊNH MỨC","ĐƠN GIÁ","THÀNH TIỀN"]
["[1]","[2]","[3]","[4]","[5]","[6]","[7]","[8]=[6]*[7]"]

{"sheet":"Gia vat lieu HTLD","index":39,"n_rows":7,"n_cols":33,"rows_kept":7,"cut":false,"hidden":true,"merged":[[4,29,5,29],[4,11,5,11],[4,5,5,5],[4,0,5,0],[4,1,5,1],[4,2,5,2],[4,3,5,3],[4,4,5,4],[4,6,5,6],[4,7,5,7],[4,20,5,20],[4,12,5,12],[4,8,5,8],[4,9,5,9],[4,10,5,10],[4,19,5,19]]}
["BẢNG TÍNH GIÁ VẬT LIỆU ĐẾN HIỆN TRƯỜNG LẮP ĐẶT THIẾT BỊ"]
[{"$f":"Bia!D42&Bia!E42","v":"CÔNG TRÌNH: CÁC PHẦN MỀM QUẢN LÝ CHI PHÍ ĐTXD CT"}]
[{"$f":"'Bia2'!D43&'Bia2'!E43","v":"HẠNG MỤC: PHẦN MỀM DỰ TOÁN GXD 10"}]
["Bốc xếp, vận chuyển nội bộ lấy NC nhóm 1, bậc 3/7:",null,null,null,null,null,{"$f":"_Nii3","v":0},"đồng",null,null,null,null,null,null,null,null,null,null,null,null,null,null,null,null,null,null,null,null,null,"ĐVT: đồng"]
["STT","MSVT","LOẠI VẬT LIỆU","ĐƠN VỊ","TRỌNG LƯỢNG ĐƠN VỊ","NGUỒN MUA","PHƯƠNG TIỆN VẬN CHUYỂN","GIÁ VẬT LIỆU TẠI NGUỒN CUNG CẤP","LOẠI ĐƯỜNG","CỰ LY (Km)","GIÁ CƯỚC","HỆ SỐ BẬC HÀNG","HỆ SỐ ĐỔ BEN","CHI PHÍ TRUNG CHUYỂN (nếu có)",null,null,null,"CP HAO HỤT VẬN CHUYỂN",null,"CHI PHÍ LƯU THÔNG KHÁC (nếu có)","GIÁ VẬT LIỆU ĐẾN CHÂN CÔNG TRÌNH","CP BỐC XẾP (nếu có)",null,"CP VẬN CHUYỂN NỘI BỘ CT (nếu có)",null,null,null,"CP HAO HỤT BẢO QUẢN",null,"GIÁ VẬT LiỆU ĐẾN HIỆN TRƯỜNG CÔNG TRÌNH"]
[null,"MÃ HIỆU",null,null,null,null,null,null,null,null,null,null,null,"Định mức bốc xếp","Thành tiền bốc xếp","Định mức hao hụt ","Thành tiền","Định mức hao hụt","Thành tiền",null,null,"Định mức bốc xếp","Thành tiền bốc xếp","ĐMVC 10 m khởi điểm","Cự ly vận chuyển nội bộ công trình","ĐMVC 10 m tiếp theo","Chi phí VC trong nội bộ công trình","Định mức hao hụt bảo quản tại hiện trường","Thành tiền",null,null,null,"`"]
["[1]","[2]","[3]","[4]","[5]","[6]","[7]","[8]","[8]","[9]","[10]","[11]","[12]","[13]","[14]","[15]","[16]","[17]","[18]","[19]","[20]","[21]","[22]","[23]","[24]","[25]","[26]","[27]","[28]","[29]"]

{"sheet":"Nhan cong LD","index":40,"n_rows":15,"n_cols":14,"rows_kept":15,"cut":false,"hidden":true,"merged":[[12,0,13,0],[12,1,13,1],[12,3,13,3],[12,4,13,4],[12,2,13,2],[6,3,6,4],[7,3,7,4],[8,3,8,4],[12,6,13,6],[12,13,13,13],[12,5,13,5]]}
["BẢNG ĐƠN GIÁ NHÂN CÔNG LẮP ĐẶT THIẾT BỊ"]
[{"$f":"Bia!D42&Bia!E42","v":"CÔNG TRÌNH: CÁC PHẦN MỀM QUẢN LÝ CHI PHÍ ĐTXD CT"}]
[]
[" - Mức lương tối thiểu chung (LTTC):",null,null,null,null,{"$f":"LTTC","v":1050000},"đồng/tháng"]
[" - Mức lương tối thiểu vùng (LTTV):",null,null,null,null,{"$f":"LTTV","v":2000000},"đồng/tháng"]
[" - Các khoản phụ cấp theo LTT:"]
[null,"Phụ cấp lưu động:",null,{"$f":"PC_LD*100&\"%*LTTC\"","v":"20%*LTTC"},null,{"$f":"LTTC*PC_LD","v":210000},"đồng/tháng"]
[null,"Phụ cấp khu vực:",null,{"$f":"PC_KV*100&\"%*LTTC\"","v":"0%*LTTC"},null,{"$f":"LTTC*PC_KV","v":0},"đồng/tháng"]
[null,"Phụ cấp độc hại:",null,{"$f":"PC_DH*100&\"%*LTTC\"","v":"0%*LTTC"},null,{"$f":"LTTC*PC_DH","v":0},"đồng/tháng"]
[null,"Tổng các phụ cấp theo LTT:",null,null,null,{"$f":"SUM(F7:F9)","v":210000},"đồng/tháng"]
["   - Mức lương đầu vào sử dụng để xác định đơn giá nhân công (LNC):",null,null,null,null,null,null,null,null,null,null,null,null,{"$f":"LNC_dauvao","v":0}]
[]
["STT","MSVT","LOẠI NHÂN CÔNG","CẤP BẬC","HỆ SỐ LƯƠNG HCB","LƯƠNG CẤP BẬC LCB (đ/tháng)","TỔNG CÁC KHOẢN PHỤ CẤP THEO LTT","CÁC KHOẢN PHỤ CẤP THEO LƯƠNG CB",null,null,null,null,null,"ĐƠN GIÁ NHÂN CÔNG\nGNC (đ/công)"]
[null,null,null,null,null,null,null,"Lương phụ","Khoán trực tiếp","Không ổn định SX","Thu hút","Đặc biệt","Ca đêm"]
["[1]","[2]","[3]","[4]","[5]",{"$f":"IF(CF_TDNCXD=0,\"[6]= [5] x LNC\",\"[6]= [5] x LTTV\")","v":"[6]= [5] x LNC"},"[7]","[8]","[9]","[10]","[11]","[12]","[13]",{"$f":"IF(CF_TDNCXD=0,\"[7]=[6]/ 26\",\"[14]=(LCB+P)/26\")","v":"[7]=[6]/ 26"}]

{"sheet":"Gia ca may LD","index":41,"n_rows":7,"n_cols":40,"rows_kept":7,"cut":false,"hidden":true,"merged":[[4,9,5,10],[4,19,5,19],[4,4,5,4],[4,12,5,12],[4,13,5,13],[4,17,5,17],[4,18,5,18],[4,11,5,11],[4,14,5,14],[4,15,5,15],[4,16,5,16],[4,0,5,0],[4,1,5,1],[4,2,5,2],[4,3,5,3],[4,5,4,8],[4,27,5,27],[4,34,5,34],[4,28,5,28],[4,35,5,35],[4,29,5,29],[4,30,5,30],[4,31,5,31],[4,32,5,32],[4,33,5,33],[4,22,4,24],[4,25,5,25],[4,26,5,26],[4,21,5,21],[4,20,5,20]]}
["BẢNG GIÁ CA MÁY VÀ THIẾT BỊ THI CÔNG LẮP ĐẶT THIẾT BỊ",null,null,null,null,null,null,null,null,null,null,null,null,null,null,null,null,null,null,null,null,null,null,null,null,null,null,null,null,null,null,null,null,null,null,null,null,"Xăng (đ/lít)","Diezel (đ/lít)","Điện (đ/kw)"]
[{"$f":"Bia!D42&Bia!E42","v":"CÔNG TRÌNH: CÁC PHẦN MỀM QUẢN LÝ CHI PHÍ ĐTXD CT"},null,null,null,null,null,null,null,null,null,null,null,null,null,null,null,null,null,null,null,null,null,null,null,null,null,null,null,null,null,null,null,null,null,null,null,"GNC gốc:",19909,19545,1622.01]
[{"$f":"'Bia2'!D43&'Bia2'!E43","v":"HẠNG MỤC: PHẦN MỀM DỰ TOÁN GXD 10"},null,null,null,null,null,null,null,null,null,null,null,null,null,null,null,null,null,null,null,null,null,null,null,null,null,null,null,null,null,null,null,null,null,null,null,"GNL hiện tại:",{"$f":"xang","v":19909},{"$f":"diezel","v":19545},{"$f":"dien","v":1622.01}]
[null,null,null,null,null,null,null,null,null,null,null,null,null,null,null,null,null,null,null,null,null,"ĐVT: đồng",null,null,null,null,null,null,null,null,null,null,null,null,null,null,"GNL chênh lệch:",{"$f":"AL3-AL2","v":0},{"$f":"AM3-AM2","v":0},{"$f":"AN3-AN2","v":0}]
["STT","MSVT","LOẠI MÁY, THIẾT BỊ","SỐ CA/ NĂM","HAO PHÍ CA MÁY","ĐỊNH MỨC KHẤU HAO, SỬA CHỮA, CHI PHÍ KHÁC / NĂM (%/GIÁ TÍNH KH)",null,null,null,"ĐỊNH MỨC TIÊU HAO NHIÊN LIỆU, NĂNG LƯỢNG 1 CA (CNL)",null,"HỆ SỐ NHIÊN LIỆU PHỤ","TỔNG HAO PHÍ NHIÊN LIỆU","CHÊNH LỆCH CHI PHÍ MTC DO CHÊNH LỆCH GIÁ NLNL","THÀNH PHẦN CẤP BẬC THỢ ĐIỀU KHIỂN MÁY","NGUYÊN GIÁ (GIÁ TÍNH KHẤU HAO)","CHI PHÍ KHẤU HAO\n(CKH)","CHI PHÍ SỬA CHỮA\n(CSC)","CHI PHÍ NHIÊN LIỆU, NĂNG LƯỢNG\n(CNL)","CHI PHÍ TIỀN LƯƠNG\n(CTL)","CHI PHÍ KHÁC\n(CCPK)","GIÁ CA MÁY\n(CCM)","CHI PHÍ TRONG GCM TẠI THỜI ĐIỂM GỐC",null,null,"CHI PHÍ NHIÊN LIỆU, NĂNG LƯỢNG TẠI THỜI ĐIỂM GỐC","CHI PHÍ TIỀN LƯƠNG TẠI THỜI ĐIỂM GỐC","NGUYÊN GIÁ (GIÁ TÍNH KHẤU HAO) TẠI THỜI ĐIỂM GỐC","NGUYÊN GIÁ (GIÁ TÍNH KHẤU HAO) TẠI THỜI ĐIỂM ĐIỀU CHỈNH","GIÁ CA MÁY GỐC","CHI PHÍ NHIỀN LIỆU, NĂNG LƯỢNG TẠI THỜI ĐIỂM ĐIỀU CHỈNH","CHI PHÍ TIỀN LƯƠNG TẠI THỜI ĐIỂM ĐIỀU CHỈNH","HỆ SỐ ĐIỀU CHỈNH NGUYÊN GIÁ (K1)","HỆ SỐ ĐIỀU CHỈNH CHI PHÍ NHIÊN LIỆU, NĂNG LƯỢNG (K2)","HỆ SỐ ĐIỀU CHỈNH CHI PHÍ TIỀN LƯƠNG (K3)","GIÁ CA MÁY ĐIỀU CHỈNH (CCMĐC)"]
[null,null,null,null,null,"Khấu hao","Hs thu hồi khi thanh lý","Sửa chữa","CP #",null,null,null,null,null,null,null,null,null,null,null,null,null,"CP khấu hao","CP sửa chữa","CP khác"]
["[1]","[2]","[3]","[4]",null,"[5]","[6]","[7]","[8]","[9]",null,"[10]",null,null,"[11]","[12]","[13]","[14]","[15]","[16]","[17]","[18]","[6]","[7]","[8]","[9]","[10]","[11]","[12]","[12]","[13]","[14]","[15]","[16]","[17]","[18]"]

{"sheet":"Du thau LD","index":42,"n_rows":6,"n_cols":19,"rows_kept":6,"cut":false,"hidden":true,"merged":[]}
["BẢNG DỰ TOÁN DỰ THẦU LẮP ĐẶT THIẾT BỊ"]
[{"$f":"Bia!D42&Bia!E42","v":"CÔNG TRÌNH: CÁC PHẦN MỀM QUẢN LÝ CHI PHÍ ĐTXD CT"}]
[{"$f":"'Bia2'!D43&'Bia2'!E43","v":"HẠNG MỤC: PHẦN MỀM DỰ TOÁN GXD 10"}]
[]
["STT","MÃ HIỆU","NỘI DUNG CÔNG VIỆC","ĐƠN VỊ","KHỐI LƯỢNG","ĐƠN GIÁ","THÀNH TIỀN","ĐGVL","ĐGVLP","ĐGNC","ĐGM","TT","T","C","TL","G","GTGT","GXDNT","GXD"]
["[1]","[2]","[3]","[4]","[5]","[6]","[7]=[5]*[6]"]

{"sheet":"NhanCong","index":43,"n_rows":391,"n_cols":20,"rows_kept":391,"cut":false,"hidden":true,"merged":[[13,16,13,17],[5,3,5,4],[6,3,6,4],[7,3,7,4],[12,5,13,5],[12,12,13,12],[12,0,13,0],[12,1,13,1],[12,2,13,2],[12,3,13,3],[12,4,13,4]]}
["BẢNG LƯƠNG NHÂN CÔNG XÂY DỰNG",null,null,null,null,null,null,null,null,null,null,null,null,null,0]
[]
[" - Mức lương tối thiểu chung (LTTC):",null,null,null,null,{"$f":"LTTC","v":1050000},"đồng/tháng",null,null,null,null,null,null,null,null,null,null,null,null,"Đây là sheet phụ, bạn không chỉnh sửa sheet này"]
[" - Mức lương tối thiểu vùng (LTTV):",null,null,null,null,{"$f":"LTTV","v":2000000},"đồng/tháng"]
[" - Các khoản phụ cấp theo LTT:"]
[null,"Phụ cấp lưu động:",null,{"$f":"PC_LD*100&\"%*LTTC\"","v":"20%*LTTC"},null,{"$f":"LTTC*PC_LD","v":210000},"đồng/tháng"]
[null,"Phụ cấp khu vực:",null,{"$f":"PC_KV*100&\"%*LTTC\"","v":"0%*LTTC"},null,{"$f":"LTTC*PC_KV","v":0},"đồng/tháng"]
[null,"Phụ cấp độc hại:",null,{"$f":"PC_DH*100&\"%*LTTC\"","v":"0%*LTTC"},null,{"$f":"LTTC*PC_DH","v":0},"đồng/tháng"]
[null,"Tổng các phụ cấp theo LTT:",null,null,null,{"$f":"SUM(F6:F8)","v":210000},"đồng/tháng"]
[]
["   - Mức lương đầu vào sử dụng để xác định đơn giá nhân công (LNC):",null,null,null,null,null,null,null,null,null,null,null,{"$f":"LNC_dauvao","v":0}]
[]
["STT","MÃ HIỆU","CẤP BẬC","HỆ SỐ LƯƠNG (HCB)","LƯƠNG CẤP BẬC (LCB=\nLNCxHCB) (đ/tháng)","TỔNG CÁC KHOẢN PHỤ CẤP THEO LTT","CÁC KHOẢN PHỤ CẤP THEO LƯƠNG CB",null,null,null,null,null,"GNC (đ/công)"]
[null,null,null,null,null,null,"Lương phụ","Khoán trực tiếp","Không ổn định SX","Thu hút","Đặc biệt","Ca đêm",null,null,null,null,"HỆ SỐ LƯƠNG"]
[{"$f":"IF(CF_TDNCXD=0,\"BẢNG LƯƠNG CÔNG NHÂN XDCB THEO THÔNG TƯ SỐ 01/2015/TT-BXD\",\"BẢNG LƯƠNG CÔNG NHÂN XDCB THEO NGHỊ ĐỊNH SỐ 205/2004/NĐ-CP\")","v":"BẢNG LƯƠNG CÔNG NHÂN XDCB THEO THÔNG TƯ SỐ 01/2015/TT-BXD"},null,null,null,null,null,null,null,null,null,null,null,null,null,null,null,"NĐ205","TT01"]
["Nhóm I"]
[null,"N1207",2,{"$f":"IF(CF_TDNCXD=0,R17,Q17)","v":1.83},{"$f":"IF(CF_TDNCXD=0,D17*LNC_dauvao,D17*LTTV)","v":0},{"$f":"$F$9*CF_TDNCXD","v":0},{"$f":"PC_LP*$E17*CF_TDNCXD","v":0},{"$f":"PC_K*$E17*CF_TDNCXD","v":0},{"$f":"PC_KODSX*$E17*CF_TDNCXD","v":0},{"$f":"PC_TH*$E17*CF_TDNCXD","v":0},{"$f":"PC_DB*$E17*CF_TDNCXD","v":0},{"$f":"PC_CD*$E17*CF_TDNCXD","v":0},{"$f":"IF(CF_TDNCXD=0,ROUND(SUM(E17:L17)/26,0),M35)","v":0},null,null,null,1.83,1.83]
[null,"N1257",2.5,1.9950000000000001,0,0,0,0,0,0,0,0,{"$f":"ROUND(SUM(E18:L18)/26,0)","v":0},null,null,null,1.9950000000000001,1.9950000000000001]
[null,"N1277",2.7,2.0609999999999999,0,0,0,0,0,0,0,0,0,null,null,null,2.0609999999999999,2.0609999999999999]
[null,"N1307",3,2.16,0,0,0,0,0,0,0,0,{"$f":"IF(CF_TDNCXD=0,ROUND(SUM(E20:L20)/26,0),M38)","v":0},null,null,null,2.16,2.16]
[null,"N1327",3.2,2.238,0,0,0,0,0,0,0,0,0,null,null,null,2.238,2.238]
[null,"N1337",3.3,2.2770000000000001,0,0,0,0,0,0,0,0,0,null,null,null,2.2770000000000001,2.2770000000000001]
[null,"N1357",3.5,2.355,0,0,0,0,0,0,0,0,0,null,null,null,2.355,2.355]
[null,"N1377",3.7,2.4329999999999998,0,0,0,0,0,0,0,0,0,null,null,null,2.4329999999999998,2.4329999999999998]
[null,"N1407",4,2.5499999999999998,0,0,0,0,0,0,0,0,{"$f":"IF(CF_TDNCXD=0,ROUND(SUM(E25:L25)/26,0),M43)","v":0},null,null,null,2.5499999999999998,2.5499999999999998]
[null,"N1437",4.3,2.6879999999999997,0,0,0,0,0,0,0,0,0,null,null,null,2.6879999999999997,2.6879999999999997]
[null,"N1457",4.5,2.78,0,0,0,0,0,0,0,0,0,null,null,null,2.78,2.78]
[null,"N1477",4.7,2.8719999999999999,0,0,0,0,0,0,0,0,0,null,null,null,2.8719999999999999,2.8719999999999999]
[null,"N1507",5,3.01,0,0,0,0,0,0,0,0,{"$f":"IF(CF_TDNCXD=0,ROUND(SUM(E29:L29)/26,0),M48)","v":0},null,null,null,3.01,3.01]
[null,"N1527",5.2,3.1199999999999997,0,0,0,0,0,0,0,0,0,null,null,null,3.1199999999999997,3.1199999999999997]
[null,"N1557",5.5,3.2850000000000001,0,0,0,0,0,0,0,0,0,null,null,null,3.2850000000000001,3.2850000000000001]
[null,"N1607",6,3.56,0,0,0,0,0,0,0,0,{"$f":"IF(CF_TDNCXD=0,ROUND(SUM(E32:L32)/26,0),M51)","v":0},null,null,null,3.56,3.56]
[null,"N1707",7,4.2,0,0,0,0,0,0,0,0,{"$f":"IF(CF_TDNCXD=0,ROUND(SUM(E33:L33)/26,0),M52)","v":0},null,null,null,4.2,4.2]
["Nhóm II"]
[null,"N2207",2,{"$f":"IF(CF_TDNCXD=0,R35,Q35)","v":2.0699999999999998},{"$f":"IF(CF_TDNCXD=0,D35*LNC_dauvao,D35*LTTV)","v":0},{"$f":"$F$9*CF_TDNCXD","v":0},{"$f":"PC_LP*$E35*CF_TDNCXD","v":0},{"$f":"PC_K*$E35*CF_TDNCXD","v":0},{"$f":"PC_KODSX*$E35*CF_TDNCXD","v":0},{"$f":"PC_TH*$E35*CF_TDNCXD","v":0},{"$f":"PC_DB*$E35*CF_TDNCXD","v":0},{"$f":"PC_CD*$E35*CF_TDNCXD","v":0},{"$f":"ROUND(SUM(E35:L35)/26,0)","v":0},null,null,null,1.96,2.0699999999999998]
[null,"N2257",2.5,2.2549999999999999,0,0,0,0,0,0,0,0,0,null,null,null,2.1349999999999998,2.2549999999999999]
[null,"N2277",2.7,2.3289999999999997,0,0,0,0,0,0,0,0,0,null,null,null,2.2050000000000001,2.3289999999999997]
[null,"N2307",3,2.44,0,0,0,0,0,0,0,0,0,null,null,null,2.31,2.44]
[null,"N2327",3.2,2.524,0,0,0,0,0,0,0,0,0,null,null,null,2.39,2.524]
[null,"N2337",3.3,2.5659999999999998,0,0,0,0,0,0,0,0,0,null,null,null,2.4750000000000001,2.5659999999999998]
[null,"N2357",3.5,2.65,0,0,0,0,0,0,0,0,0,null,null,null,2.5099999999999998,2.65]
[null,"N2377",3.7,2.734,0,0,0,0,0,0,0,0,0,null,null,null,2.59,2.734]
[null,"N2407",4,2.86,0,0,0,0,0,0,0,0,0,null,null,null,2.71,2.86]
[null,"N2427",4.2,2.9620000000000006,0,0,0,0,0,0,0,0,0,null,null,null,2.806,2.9620000000000006]
[null,"N2437",4.3,3.0130000000000003,0,0,0,0,0,0,0,0,{"$f":"ROUND(SUM(E45:L45)/26,0)","v":0},null,null,null,2.8540000000000001,3.0130000000000003]
[null,"N2457",4.5,3.1150000000000002,0,0,0,0,0,0,0,0,0,null,null,null,2.95,3.1150000000000002]
[null,"N2477",4.7,3.2170000000000005,0,0,0,0,0,0,0,0,0,null,null,null,3.0459999999999998,3.2170000000000005]
[null,"N2507",5,3.3700000000000006,0,0,0,0,0,0,0,0,0,null,null,null,3.19,3.3700000000000006]
[null,"N2527",5.2,3.488,0,0,0,0,0,0,0,0,0,null,null,null,3.3,3.488]
[null,"N2557",5.5,3.665,0,0,0,0,0,0,0,0,0,null,null,null,3.4649999999999999,3.665]
[null,"N2607",6,3.96,0,0,0,0,0,0,0,0,0,null,null,null,3.74,3.96]
[null,"N2707",7,4.6500000000000004,0,0,0,0,0,0,0,0,0,null,null,null,4.4000000000000004,4.6500000000000004]
["Nhóm III","(tạm để để xử lý nhân công nhóm 3 cũ)"]
[null,"N3207",2,{"$f":"IF(CF_TDNCXD=0,R54,Q54)","v":2.0699999999999998},{"$f":"IF(CF_TDNCXD=0,D54*LNC_dauvao,D54*LTTV)","v":0},{"$f":"$F$9*CF_TDNCXD","v":0},{"$f":"PC_LP*$E54*CF_TDNCXD","v":0},{"$f":"PC_K*$E54*CF_TDNCXD","v":0},{"$f":"PC_KODSX*$E54*CF_TDNCXD","v":0},{"$f":"PC_TH*$E54*CF_TDNCXD","v":0},{"$f":"PC_DB*$E54*CF_TDNCXD","v":0},{"$f":"PC_CD*$E54*CF_TDNCXD","v":0},{"$f":"ROUND(SUM(E54:L54)/26,0)","v":0},null,null,null,2.1800000000000002,2.0699999999999998]
[null,"N3257",2.5,2.2549999999999999,0,0,0,0,0,0,0,0,0,null,null,null,2.37,2.2549999999999999]
[null,"N3277",2.7,2.3289999999999997,0,0,0,0,0,0,0,0,0,null,null,null,2.4460000000000002,2.3289999999999997]
[null,"N3307",3,2.44,0,0,0,0,0,0,0,0,0,null,null,null,2.56,2.44]
[null,"N3327",3.2,2.524,0,0,0,0,0,0,0,0,0,null,null,null,2.65,2.524]
[null,"N3357",3.5,2.65,0,0,0,0,0,0,0,0,0,null,null,null,2.7850000000000001,2.65]
[null,"N3377",3.7,2.734,0,0,0,0,0,0,0,0,0,null,null,null,2.875,2.734]
[null,"N3407",4,2.86,0,0,0,0,0,0,0,0,0,null,null,null,3.01,2.86]
[null,"N3427",4.2,2.9620000000000006,0,0,0,0,0,0,0,0,0,null,null,null,3.1159999999999997,2.9620000000000006]
[null,"N3437",4.3,3.0130000000000003,0,0,0,0,0,0,0,0,0,null,null,null,3.169,3.0130000000000003]
[null,"N3457",4.5,3.1150000000000002,0,0,0,0,0,0,0,0,0,null,null,null,3.2749999999999999,3.1150000000000002]
[null,"N3477",4.7,3.2170000000000005,0,0,0,0,0,0,0,0,0,null,null,null,3.3809999999999998,3.2170000000000005]
[null,"N3507",5,3.3700000000000006,0,0,0,0,0,0,0,0,0,null,null,null,3.54,3.3700000000000006]
[null,"N3527",5.2,3.488,0,0,0,0,0,0,0,0,0,null,null,null,3.6659999999999999,3.488]
[null,"N3557",5.5,3.665,0,0,0,0,0,0,0,0,0,null,null,null,3.855,3.665]
[null,"N3607",6,3.96,0,0,0,0,0,0,0,0,0,null,null,null,4.17,3.96]
[null,"N3707",7,4.6500000000000004,0,0,0,0,0,0,0,0,0,null,null,null,4.9000000000000004,4.6500000000000004]
[]
["Nhóm I"]
[null,"N1307dt",3,{"$f":"IF(CF_TDNCXD=0,R73,Q73)","v":2.16},{"$f":"IF(CF_TDNCXD=0,D73*LNC_dauvao,D73*LTTV)","v":0},{"$f":"$F$9*CF_TDNCXD","v":0},{"$f":"PC_LP*$E73*CF_TDNCXD","v":0},{"$f":"PC_K*$E73*CF_TDNCXD","v":0},{"$f":"PC_KODSX*$E73*CF_TDNCXD","v":0},{"$f":"PC_TH*$E73*CF_TDNCXD","v":0},{"$f":"PC_DB*$E73*CF_TDNCXD","v":0},{"$f":"PC_CD*$E73*CF_TDNCXD","v":0},{"$f":"ROUND(SUM(E73:L73)/26,0)","v":0},null,null,null,2.16,2.16]
[null,"N1357dt",3.5,2.355,0,0,0,0,0,0,0,0,0,null,null,null,2.355,2.355]
[null,"N1407dt",4,2.5499999999999998,0,0,0,0,0,0,0,0,0,null,null,null,2.5499999999999998,2.5499999999999998]
[null,"N1457dt",4.5,2.78,0,0,0,0,0,0,0,0,0,null,null,null,2.78,2.78]
[null,"N1507dt",5,3.01,0,0,0,0,0,0,0,0,0,null,null,null,3.01,3.01]
[null,"N1557dt",5.5,3.2850000000000001,0,0,0,0,0,0,0,0,0,null,null,null,3.2850000000000001,3.2850000000000001]
[null,"N1607dt",6,3.56,0,0,0,0,0,0,0,0,0,null,null,null,3.56,3.56]
[null,"N1707dt",7,4.2,0,0,0,0,0,0,0,0,0,null,null,null,4.2,4.2]
["Nhóm II"]
[null,"N2307dt",3,{"$f":"IF(CF_TDNCXD=0,R82,Q82)","v":2.31},{"$f":"IF(CF_TDNCXD=0,D82*LNC_dauvao,D82*LTTV)","v":0},{"$f":"$F$9*CF_TDNCXD","v":0},{"$f":"PC_LP*$E82*CF_TDNCXD","v":0},{"$f":"PC_K*$E82*CF_TDNCXD","v":0},{"$f":"PC_KODSX*$E82*CF_TDNCXD","v":0},{"$f":"PC_TH*$E82*CF_TDNCXD","v":0},{"$f":"PC_DB*$E82*CF_TDNCXD","v":0},{"$f":"PC_CD*$E82*CF_TDNCXD","v":0},{"$f":"ROUND(SUM(E82:L82)/26,0)","v":0},null,null,null,2.31,2.31]
[null,"N2357dt",3.5,2.5099999999999998,0,0,0,0,0,0,0,0,0,null,null,null,2.5099999999999998,2.5099999999999998]
[null,"N2407dt",4,2.71,0,0,0,0,0,0,0,0,0,null,null,null,2.71,2.71]
[null,"N2457dt",4.5,2.95,0,0,0,0,0,0,0,0,0,null,null,null,2.95,2.95]
[null,"N2507dt",5,3.19,0,0,0,0,0,0,0,0,0,null,null,null,3.19,3.19]
[null,"N2557dt",5.5,3.4649999999999999,0,0,0,0,0,0,0,0,0,null,null,null,3.4649999999999999,3.4649999999999999]
[null,"N2607dt",6,3.74,0,0,0,0,0,0,0,0,0,null,null,null,3.74,3.74]
[null,"N2707dt",7,4.4000000000000004,0,0,0,0,0,0,0,0,0,null,null,null,4.4000000000000004,4.4000000000000004]
["Nhóm III"]
[null,"N3307dt",3,{"$f":"IF(CF_TDNCXD=0,R91,Q91)","v":2.48},{"$f":"IF(CF_TDNCXD=0,D91*LNC_dauvao,D91*LTTV)","v":0},{"$f":"$F$9*CF_TDNCXD","v":0},{"$f":"PC_LP*$E91*CF_TDNCXD","v":0},{"$f":"PC_K*$E91*CF_TDNCXD","v":0},{"$f":"PC_KODSX*$E91*CF_TDNCXD","v":0},{"$f":"PC_TH*$E91*CF_TDNCXD","v":0},{"$f":"PC_DB*$E91*CF_TDNCXD","v":0},{"$f":"PC_CD*$E91*CF_TDNCXD","v":0},{"$f":"ROUND(SUM(E91:L91)/26,0)","v":0},null,null,null,2.48,2.48]
[null,"N3357dt",3.5,2.7,0,0,0,0,0,0,0,0,0,null,null,null,2.7,2.7]
[null,"N3407dt",4,2.92,0,0,0,0,0,0,0,0,0,null,null,null,2.92,2.92]
[null,"N3457dt",4.5,3.1850000000000001,0,0,0,0,0,0,0,0,0,null,null,null,3.1850000000000001,3.1850000000000001]
[null,"N3507dt",5,3.45,0,0,0,0,0,0,0,0,0,null,null,null,3.45,3.45]
[null,"N3557dt",5.5,3.7600000000000002,0,0,0,0,0,0,0,0,0,null,null,null,3.7600000000000002,3.7600000000000002]
[null,"N3607dt",6,4.07,0,0,0,0,0,0,0,0,0,null,null,null,4.07,4.07]
[null,"N3707dt",7,4.8,0,0,0,0,0,0,0,0,0,null,null,null,4.8,4.8]
["II. BẢNG LƯƠNG THỢ LẶN"]
["1. Thợ lặn"]
[null,"NTL01","I",{"$f":"IF(CF_TDNCXD=0,R101,Q101)","v":2.99},{"$f":"IF(CF_TDNCXD=0,D101*LNC_dauvao,D101*LTTV)","v":0},{"$f":"$F$9*CF_TDNCXD","v":0},{"$f":"PC_LP*$E101*CF_TDNCXD","v":0},{"$f":"PC_K*$E101*CF_TDNCXD","v":0},{"$f":"PC_KODSX*$E101*CF_TDNCXD","v":0},{"$f":"PC_TH*$E101*CF_TDNCXD","v":0},{"$f":"PC_DB*$E101*CF_TDNCXD","v":0},{"$f":"PC_CD*$E101*CF_TDNCXD","v":0},{"$f":"ROUND(SUM(E101:L101)/26,0)","v":0},null,null,null,2.99,2.99]
[null,"NTL02","II",3.28,{"$f":"IF(CF_TDNCXD=0,D102*LNC_dauvao,D102*LTTV)","v":0},0,0,0,0,0,0,0,{"$f":"ROUND(SUM(E102:L102)/26,0)","v":0},null,null,null,3.28,3.28]
[null,"NTL03","III",3.72,{"$f":"IF(CF_TDNCXD=0,D103*LNC_dauvao,D103*LTTV)","v":0},0,0,0,0,0,0,0,{"$f":"ROUND(SUM(E103:L103)/26,0)","v":0},null,null,null,3.72,3.72]
[null,"NTL04","IV",4.1500000000000004,{"$f":"IF(CF_TDNCXD=0,D104*LNC_dauvao,D104*LTTV)","v":0},0,0,0,0,0,0,0,{"$f":"ROUND(SUM(E104:L104)/26,0)","v":0},null,null,null,4.1500000000000004,4.1500000000000004]
["2. Thợ lặn cấp I",null,null,0,null,0,0,0,0,0,0,0]
["","NTL11","I",4.67,{"$f":"IF(CF_TDNCXD=0,D106*LNC_dauvao,D106*LTTV)","v":0},0,0,0,0,0,0,0,{"$f":"ROUND(SUM(E106:L106)/26,0)","v":0},null,null,null,4.67,4.67]
[" ","NTL12","II",5.27,{"$f":"IF(CF_TDNCXD=0,D107*LNC_dauvao,D107*LTTV)","v":0},0,0,0,0,0,0,0,{"$f":"ROUND(SUM(E107:L107)/26,0)","v":0},null,null,null,5.27,5.27]
["3. Thợ lặn cấp III",null,null,0,null,0,0,0,0,0,0,0]
["","NTL31","I",5.75,{"$f":"IF(CF_TDNCXD=0,D109*LNC_dauvao,D109*LTTV)","v":0},0,0,0,0,0,0,0,{"$f":"ROUND(SUM(E109:L109)/26,0)","v":0},null,null,null,5.75,5.75]
["B.12. BẢNG LƯƠNG CÔNG NHÂN LÁI XE"]
["1. Xe con, xe tắc xi, xe tải, xe cẩu dưới 3,5 tấn, xe khách dưới 20 ghế"]
[null,"NLX11","I",{"$f":"IF(CF_TDNCXD=0,R112,Q112)","v":2.1800000000000002},{"$f":"IF(CF_TDNCXD=0,D112*LNC_dauvao,D112*LTTV)","v":0},{"$f":"$F$9*CF_TDNCXD","v":0},{"$f":"PC_LP*$E112*CF_TDNCXD","v":0},{"$f":"PC_K*$E112*CF_TDNCXD","v":0},{"$f":"PC_KODSX*$E112*CF_TDNCXD","v":0},{"$f":"PC_TH*$E112*CF_TDNCXD","v":0},{"$f":"PC_DB*$E112*CF_TDNCXD","v":0},{"$f":"PC_CD*$E112*CF_TDNCXD","v":0},{"$f":"ROUND(SUM(E112:L112)/26,0)","v":0},null,null,null,2.1800000000000002,2.1800000000000002]
[null,"NLX12","II",{"$f":"IF(CF_TDNCXD=0,R113,Q113)","v":2.57},{"$f":"IF(CF_TDNCXD=0,D113*LNC_dauvao,D113*LTTV)","v":0},{"$f":"$F$9*CF_TDNCXD","v":0},{"$f":"PC_LP*$E113*CF_TDNCXD","v":0},{"$f":"PC_K*$E113*CF_TDNCXD","v":0},{"$f":"PC_KODSX*$E113*CF_TDNCXD","v":0},{"$f":"PC_TH*$E113*CF_TDNCXD","v":0},{"$f":"PC_DB*$E113*CF_TDNCXD","v":0},{"$f":"PC_CD*$E113*CF_TDNCXD","v":0},{"$f":"ROUND(SUM(E113:L113)/26,0)","v":0},null,null,null,2.57,2.57]
[null,"NLX13","III",{"$f":"IF(CF_TDNCXD=0,R114,Q114)","v":3.05},{"$f":"IF(CF_TDNCXD=0,D114*LNC_dauvao,D114*LTTV)","v":0},{"$f":"$F$9*CF_TDNCXD","v":0},{"$f":"PC_LP*$E114*CF_TDNCXD","v":0},{"$f":"PC_K*$E114*CF_TDNCXD","v":0},{"$f":"PC_KODSX*$E114*CF_TDNCXD","v":0},{"$f":"PC_TH*$E114*CF_TDNCXD","v":0},{"$f":"PC_DB*$E114*CF_TDNCXD","v":0},{"$f":"PC_CD*$E114*CF_TDNCXD","v":0},{"$f":"ROUND(SUM(E114:L114)/26,0)","v":0},null,null,null,3.05,3.05]
[null,"NLX14","IV",{"$f":"IF(CF_TDNCXD=0,R115,Q115)","v":3.6},{"$f":"IF(CF_TDNCXD=0,D115*LNC_dauvao,D115*LTTV)","v":0},{"$f":"$F$9*CF_TDNCXD","v":0},{"$f":"PC_LP*$E115*CF_TDNCXD","v":0},{"$f":"PC_K*$E115*CF_TDNCXD","v":0},{"$f":"PC_KODSX*$E115*CF_TDNCXD","v":0},{"$f":"PC_TH*$E115*CF_TDNCXD","v":0},{"$f":"PC_DB*$E115*CF_TDNCXD","v":0},{"$f":"PC_CD*$E115*CF_TDNCXD","v":0},{"$f":"ROUND(SUM(E115:L115)/26,0)","v":0},null,null,null,3.6,3.6]
["2. Xe tải, xe cẩu từ 3,5 tấn đến dưới 7,5 tấn, xe khách từ 20 ghế đến dưới 40 ghế"]
[null,"NLX21","I",{"$f":"IF(CF_TDNCXD=0,R117,Q117)","v":2.1800000000000002},{"$f":"IF(CF_TDNCXD=0,D117*LNC_dauvao,D117*LTTV)","v":0},{"$f":"$F$9*CF_TDNCXD","v":0},{"$f":"PC_LP*$E117*CF_TDNCXD","v":0},{"$f":"PC_K*$E117*CF_TDNCXD","v":0},{"$f":"PC_KODSX*$E117*CF_TDNCXD","v":0},{"$f":"PC_TH*$E117*CF_TDNCXD","v":0},{"$f":"PC_DB*$E117*CF_TDNCXD","v":0},{"$f":"PC_CD*$E117*CF_TDNCXD","v":0},{"$f":"ROUND(SUM(E117:L117)/26,0)","v":0},null,null,null,2.35,2.1800000000000002]
[null,"NLX22","II",{"$f":"IF(CF_TDNCXD=0,R118,Q118)","v":2.57},{"$f":"IF(CF_TDNCXD=0,D118*LNC_dauvao,D118*LTTV)","v":0},{"$f":"$F$9*CF_TDNCXD","v":0},{"$f":"PC_LP*$E118*CF_TDNCXD","v":0},{"$f":"PC_K*$E118*CF_TDNCXD","v":0},{"$f":"PC_KODSX*$E118*CF_TDNCXD","v":0},{"$f":"PC_TH*$E118*CF_TDNCXD","v":0},{"$f":"PC_DB*$E118*CF_TDNCXD","v":0},{"$f":"PC_CD*$E118*CF_TDNCXD","v":0},{"$f":"ROUND(SUM(E118:L118)/26,0)","v":0},null,null,null,2.76,2.57]
[null,"NLX23","III",{"$f":"IF(CF_TDNCXD=0,R119,Q119)","v":3.05},{"$f":"IF(CF_TDNCXD=0,D119*LNC_dauvao,D119*LTTV)","v":0},{"$f":"$F$9*CF_TDNCXD","v":0},{"$f":"PC_LP*$E119*CF_TDNCXD","v":0},{"$f":"PC_K*$E119*CF_TDNCXD","v":0},{"$f":"PC_KODSX*$E119*CF_TDNCXD","v":0},{"$f":"PC_TH*$E119*CF_TDNCXD","v":0},{"$f":"PC_DB*$E119*CF_TDNCXD","v":0},{"$f":"PC_CD*$E119*CF_TDNCXD","v":0},{"$f":"ROUND(SUM(E119:L119)/26,0)","v":0},null,null,null,3.25,3.05]
[null,"NLX24","IV",{"$f":"IF(CF_TDNCXD=0,R120,Q120)","v":3.6},{"$f":"IF(CF_TDNCXD=0,D120*LNC_dauvao,D120*LTTV)","v":0},{"$f":"$F$9*CF_TDNCXD","v":0},{"$f":"PC_LP*$E120*CF_TDNCXD","v":0},{"$f":"PC_K*$E120*CF_TDNCXD","v":0},{"$f":"PC_KODSX*$E120*CF_TDNCXD","v":0},{"$f":"PC_TH*$E120*CF_TDNCXD","v":0},{"$f":"PC_DB*$E120*CF_TDNCXD","v":0},{"$f":"PC_CD*$E120*CF_TDNCXD","v":0},{"$f":"ROUND(SUM(E120:L120)/26,0)","v":0},null,null,null,3.82,3.6]
["3. Xe tải, xe cẩu từ 7,5 tấn đến dưới 16,5 tấn, xe khách từ 40 ghế đến dưới 60 ghế"]
[null,"NLX31","I",{"$f":"IF(CF_TDNCXD=0,R122,Q122)","v":2.5099999999999998},{"$f":"IF(CF_TDNCXD=0,D122*LNC_dauvao,D122*LTTV)","v":0},{"$f":"$F$9*CF_TDNCXD","v":0},{"$f":"PC_LP*$E122*CF_TDNCXD","v":0},{"$f":"PC_K*$E122*CF_TDNCXD","v":0},{"$f":"PC_KODSX*$E122*CF_TDNCXD","v":0},{"$f":"PC_TH*$E122*CF_TDNCXD","v":0},{"$f":"PC_DB*$E122*CF_TDNCXD","v":0},{"$f":"PC_CD*$E122*CF_TDNCXD","v":0},{"$f":"ROUND(SUM(E122:L122)/26,0)","v":0},null,null,null,2.5099999999999998,2.5099999999999998]
[null,"NLX32","II",{"$f":"IF(CF_TDNCXD=0,R123,Q123)","v":2.94},{"$f":"IF(CF_TDNCXD=0,D123*LNC_dauvao,D123*LTTV)","v":0},{"$f":"$F$9*CF_TDNCXD","v":0},{"$f":"PC_LP*$E123*CF_TDNCXD","v":0},{"$f":"PC_K*$E123*CF_TDNCXD","v":0},{"$f":"PC_KODSX*$E123*CF_TDNCXD","v":0},{"$f":"PC_TH*$E123*CF_TDNCXD","v":0},{"$f":"PC_DB*$E123*CF_TDNCXD","v":0},{"$f":"PC_CD*$E123*CF_TDNCXD","v":0},{"$f":"ROUND(SUM(E123:L123)/26,0)","v":0},null,null,null,2.94,2.94]
[null,"NLX33","III",{"$f":"IF(CF_TDNCXD=0,R124,Q124)","v":3.44},{"$f":"IF(CF_TDNCXD=0,D124*LNC_dauvao,D124*LTTV)","v":0},{"$f":"$F$9*CF_TDNCXD","v":0},{"$f":"PC_LP*$E124*CF_TDNCXD","v":0},{"$f":"PC_K*$E124*CF_TDNCXD","v":0},{"$f":"PC_KODSX*$E124*CF_TDNCXD","v":0},{"$f":"PC_TH*$E124*CF_TDNCXD","v":0},{"$f":"PC_DB*$E124*CF_TDNCXD","v":0},{"$f":"PC_CD*$E124*CF_TDNCXD","v":0},{"$f":"ROUND(SUM(E124:L124)/26,0)","v":0},null,null,null,3.44,3.44]
[null,"NLX34","IV",{"$f":"IF(CF_TDNCXD=0,R125,Q125)","v":4.05},{"$f":"IF(CF_TDNCXD=0,D125*LNC_dauvao,D125*LTTV)","v":0},{"$f":"$F$9*CF_TDNCXD","v":0},{"$f":"PC_LP*$E125*CF_TDNCXD","v":0},{"$f":"PC_K*$E125*CF_TDNCXD","v":0},{"$f":"PC_KODSX*$E125*CF_TDNCXD","v":0},{"$f":"PC_TH*$E125*CF_TDNCXD","v":0},{"$f":"PC_DB*$E125*CF_TDNCXD","v":0},{"$f":"PC_CD*$E125*CF_TDNCXD","v":0},{"$f":"ROUND(SUM(E125:L125)/26,0)","v":0},null,null,null,4.05,4.05]
["4. Xe tải, xe cẩu từ 16,5 tấn đến dưới 25 tấn, xe khách từ 60 ghế đến dưới 80 ghế"]
[null,"NLX41","I",{"$f":"IF(CF_TDNCXD=0,R127,Q127)","v":2.5099999999999998},{"$f":"IF(CF_TDNCXD=0,D127*LNC_dauvao,D127*LTTV)","v":0},{"$f":"$F$9*CF_TDNCXD","v":0},{"$f":"PC_LP*$E127*CF_TDNCXD","v":0},{"$f":"PC_K*$E127*CF_TDNCXD","v":0},{"$f":"PC_KODSX*$E127*CF_TDNCXD","v":0},{"$f":"PC_TH*$E127*CF_TDNCXD","v":0},{"$f":"PC_DB*$E127*CF_TDNCXD","v":0},{"$f":"PC_CD*$E127*CF_TDNCXD","v":0},{"$f":"ROUND(SUM(E127:L127)/26,0)","v":0},null,null,null,2.66,2.5099999999999998]
[null,"NLX42","II",{"$f":"IF(CF_TDNCXD=0,R128,Q128)","v":2.94},{"$f":"IF(CF_TDNCXD=0,D128*LNC_dauvao,D128*LTTV)","v":0},{"$f":"$F$9*CF_TDNCXD","v":0},{"$f":"PC_LP*$E128*CF_TDNCXD","v":0},{"$f":"PC_K*$E128*CF_TDNCXD","v":0},{"$f":"PC_KODSX*$E128*CF_TDNCXD","v":0},{"$f":"PC_TH*$E128*CF_TDNCXD","v":0},{"$f":"PC_DB*$E128*CF_TDNCXD","v":0},{"$f":"PC_CD*$E128*CF_TDNCXD","v":0},{"$f":"ROUND(SUM(E128:L128)/26,0)","v":0},null,null,null,3.11,2.94]
[null,"NLX43","III",{"$f":"IF(CF_TDNCXD=0,R129,Q129)","v":3.44},{"$f":"IF(CF_TDNCXD=0,D129*LNC_dauvao,D129*LTTV)","v":0},{"$f":"$F$9*CF_TDNCXD","v":0},{"$f":"PC_LP*$E129*CF_TDNCXD","v":0},{"$f":"PC_K*$E129*CF_TDNCXD","v":0},{"$f":"PC_KODSX*$E129*CF_TDNCXD","v":0},{"$f":"PC_TH*$E129*CF_TDNCXD","v":0},{"$f":"PC_DB*$E129*CF_TDNCXD","v":0},{"$f":"PC_CD*$E129*CF_TDNCXD","v":0},{"$f":"ROUND(SUM(E129:L129)/26,0)","v":0},null,null,null,3.64,3.44]
[null,"NLX44","IV",{"$f":"IF(CF_TDNCXD=0,R130,Q130)","v":4.05},{"$f":"IF(CF_TDNCXD=0,D130*LNC_dauvao,D130*LTTV)","v":0},{"$f":"$F$9*CF_TDNCXD","v":0},{"$f":"PC_LP*$E130*CF_TDNCXD","v":0},{"$f":"PC_K*$E130*CF_TDNCXD","v":0},{"$f":"PC_KODSX*$E130*CF_TDNCXD","v":0},{"$f":"PC_TH*$E130*CF_TDNCXD","v":0},{"$f":"PC_DB*$E130*CF_TDNCXD","v":0},{"$f":"PC_CD*$E130*CF_TDNCXD","v":0},{"$f":"ROUND(SUM(E130:L130)/26,0)","v":0},null,null,null,4.2,4.05]
["5. Xe tải, xe cẩu từ 25 tấn đến dưới 40 tấn, xe khách từ 80 ghế trở lên"]
[null,"NLX51","I",{"$f":"IF(CF_TDNCXD=0,R132,Q132)","v":2.99},{"$f":"IF(CF_TDNCXD=0,D132*LNC_dauvao,D132*LTTV)","v":0},{"$f":"$F$9*CF_TDNCXD","v":0},{"$f":"PC_LP*$E132*CF_TDNCXD","v":0},{"$f":"PC_K*$E132*CF_TDNCXD","v":0},{"$f":"PC_KODSX*$E132*CF_TDNCXD","v":0},{"$f":"PC_TH*$E132*CF_TDNCXD","v":0},{"$f":"PC_DB*$E132*CF_TDNCXD","v":0},{"$f":"PC_CD*$E132*CF_TDNCXD","v":0},{"$f":"ROUND(SUM(E132:L132)/26,0)","v":0},null,null,null,2.99,2.99]
[null,"NLX52","II",{"$f":"IF(CF_TDNCXD=0,R133,Q133)","v":3.5},{"$f":"IF(CF_TDNCXD=0,D133*LNC_dauvao,D133*LTTV)","v":0},{"$f":"$F$9*CF_TDNCXD","v":0},{"$f":"PC_LP*$E133*CF_TDNCXD","v":0},{"$f":"PC_K*$E133*CF_TDNCXD","v":0},{"$f":"PC_KODSX*$E133*CF_TDNCXD","v":0},{"$f":"PC_TH*$E133*CF_TDNCXD","v":0},{"$f":"PC_DB*$E133*CF_TDNCXD","v":0},{"$f":"PC_CD*$E133*CF_TDNCXD","v":0},{"$f":"ROUND(SUM(E133:L133)/26,0)","v":0},null,null,null,3.5,3.5]
[null,"NLX53","III",{"$f":"IF(CF_TDNCXD=0,R134,Q134)","v":4.1100000000000003},{"$f":"IF(CF_TDNCXD=0,D134*LNC_dauvao,D134*LTTV)","v":0},{"$f":"$F$9*CF_TDNCXD","v":0},{"$f":"PC_LP*$E134*CF_TDNCXD","v":0},{"$f":"PC_K*$E134*CF_TDNCXD","v":0},{"$f":"PC_KODSX*$E134*CF_TDNCXD","v":0},{"$f":"PC_TH*$E134*CF_TDNCXD","v":0},{"$f":"PC_DB*$E134*CF_TDNCXD","v":0},{"$f":"PC_CD*$E134*CF_TDNCXD","v":0},{"$f":"ROUND(SUM(E134:L134)/26,0)","v":0},null,null,null,4.1100000000000003,4.1100000000000003]
[null,"NLX54","IV",{"$f":"IF(CF_TDNCXD=0,R135,Q135)","v":4.82},{"$f":"IF(CF_TDNCXD=0,D135*LNC_dauvao,D135*LTTV)","v":0},{"$f":"$F$9*CF_TDNCXD","v":0},{"$f":"PC_LP*$E135*CF_TDNCXD","v":0},{"$f":"PC_K*$E135*CF_TDNCXD","v":0},{"$f":"PC_KODSX*$E135*CF_TDNCXD","v":0},{"$f":"PC_TH*$E135*CF_TDNCXD","v":0},{"$f":"PC_DB*$E135*CF_TDNCXD","v":0},{"$f":"PC_CD*$E135*CF_TDNCXD","v":0},{"$f":"ROUND(SUM(E135:L135)/26,0)","v":0},null,null,null,4.82,4.82]
["6. Xe tải, xe cẩu từ 40 tấn trở lên"]
[null,"NLX61","I",{"$f":"IF(CF_TDNCXD=0,R137,Q137)","v":2.99},{"$f":"IF(CF_TDNCXD=0,D137*LNC_dauvao,D137*LTTV)","v":0},{"$f":"$F$9*CF_TDNCXD","v":0},{"$f":"PC_LP*$E137*CF_TDNCXD","v":0},{"$f":"PC_K*$E137*CF_TDNCXD","v":0},{"$f":"PC_KODSX*$E137*CF_TDNCXD","v":0},{"$f":"PC_TH*$E137*CF_TDNCXD","v":0},{"$f":"PC_DB*$E137*CF_TDNCXD","v":0},{"$f":"PC_CD*$E137*CF_TDNCXD","v":0},{"$f":"ROUND(SUM(E137:L137)/26,0)","v":0},null,null,null,3.2,2.99]
[null,"NLX62","II",{"$f":"IF(CF_TDNCXD=0,R138,Q138)","v":3.5},{"$f":"IF(CF_TDNCXD=0,D138*LNC_dauvao,D138*LTTV)","v":0},{"$f":"$F$9*CF_TDNCXD","v":0},{"$f":"PC_LP*$E138*CF_TDNCXD","v":0},{"$f":"PC_K*$E138*CF_TDNCXD","v":0},{"$f":"PC_KODSX*$E138*CF_TDNCXD","v":0},{"$f":"PC_TH*$E138*CF_TDNCXD","v":0},{"$f":"PC_DB*$E138*CF_TDNCXD","v":0},{"$f":"PC_CD*$E138*CF_TDNCXD","v":0},{"$f":"ROUND(SUM(E138:L138)/26,0)","v":0},null,null,null,3.75,3.5]
[null,"NLX63","III",{"$f":"IF(CF_TDNCXD=0,R139,Q139)","v":4.1100000000000003},{"$f":"IF(CF_TDNCXD=0,D139*LNC_dauvao,D139*LTTV)","v":0},{"$f":"$F$9*CF_TDNCXD","v":0},{"$f":"PC_LP*$E139*CF_TDNCXD","v":0},{"$f":"PC_K*$E139*CF_TDNCXD","v":0},{"$f":"PC_KODSX*$E139*CF_TDNCXD","v":0},{"$f":"PC_TH*$E139*CF_TDNCXD","v":0},{"$f":"PC_DB*$E139*CF_TDNCXD","v":0},{"$f":"PC_CD*$E139*CF_TDNCXD","v":0},{"$f":"ROUND(SUM(E139:L139)/26,0)","v":0},null,null,null,4.3899999999999997,4.1100000000000003]
[null,"NLX64","IV",{"$f":"IF(CF_TDNCXD=0,R140,Q140)","v":4.82},{"$f":"IF(CF_TDNCXD=0,D140*LNC_dauvao,D140*LTTV)","v":0},{"$f":"$F$9*CF_TDNCXD","v":0},{"$f":"PC_LP*$E140*CF_TDNCXD","v":0},{"$f":"PC_K*$E140*CF_TDNCXD","v":0},{"$f":"PC_KODSX*$E140*CF_TDNCXD","v":0},{"$f":"PC_TH*$E140*CF_TDNCXD","v":0},{"$f":"PC_DB*$E140*CF_TDNCXD","v":0},{"$f":"PC_CD*$E140*CF_TDNCXD","v":0},{"$f":"ROUND(SUM(E140:L140)/26,0)","v":0},null,null,null,5.15,4.82]
["B.2. BẢNG LƯƠNG THUYỀN VIÊN VÀ CÔNG NHÂN VIÊN TÀU VẬN TẢI BIỂN, VẬN TẢI SÔNG, TÀU DỊCH VỤ DẦU KHÍ, TÀU CẨU DẦU KHÍ"]
["B.2.I. TÀU VẬN TẢI BIỂN, VẬN TẢI SÔNG"]
["B.2.I.1. Tàu vận tải biển, vận tải sông không theo nhóm tàu "]
["CHỨC DANH KHÔNG THEO NHÓM TÀU"]
["I/ Tàu vận tải biển"]
["1. Thuỷ thủ"]
[null,"NBTT11",null,{"$f":"IF(CF_TDNCXD=0,R147,Q147)","v":2.1800000000000002},{"$f":"IF(CF_TDNCXD=0,D147*LNC_dauvao,D147*LTTV)","v":0},{"$f":"$F$9*CF_TDNCXD","v":0},{"$f":"PC_LP*$E147*CF_TDNCXD","v":0},{"$f":"PC_K*$E147*CF_TDNCXD","v":0},{"$f":"PC_KODSX*$E147*CF_TDNCXD","v":0},{"$f":"PC_TH*$E147*CF_TDNCXD","v":0},{"$f":"PC_DB*$E147*CF_TDNCXD","v":0},{"$f":"PC_CD*$E147*CF_TDNCXD","v":0},{"$f":"ROUND(SUM(E147:L147)/26,0)","v":0},null,null,null,2.1800000000000002,2.1800000000000002]
[null,"NBTT12",null,{"$f":"IF(CF_TDNCXD=0,R148,Q148)","v":2.59},{"$f":"IF(CF_TDNCXD=0,D148*LNC_dauvao,D148*LTTV)","v":0},{"$f":"$F$9*CF_TDNCXD","v":0},{"$f":"PC_LP*$E148*CF_TDNCXD","v":0},{"$f":"PC_K*$E148*CF_TDNCXD","v":0},{"$f":"PC_KODSX*$E148*CF_TDNCXD","v":0},{"$f":"PC_TH*$E148*CF_TDNCXD","v":0},{"$f":"PC_DB*$E148*CF_TDNCXD","v":0},{"$f":"PC_CD*$E148*CF_TDNCXD","v":0},{"$f":"ROUND(SUM(E148:L148)/26,0)","v":0},null,null,null,2.59,2.59]
[null,"NBTT13",null,{"$f":"IF(CF_TDNCXD=0,R149,Q149)","v":3.08},{"$f":"IF(CF_TDNCXD=0,D149*LNC_dauvao,D149*LTTV)","v":0},{"$f":"$F$9*CF_TDNCXD","v":0},{"$f":"PC_LP*$E149*CF_TDNCXD","v":0},{"$f":"PC_K*$E149*CF_TDNCXD","v":0},{"$f":"PC_KODSX*$E149*CF_TDNCXD","v":0},{"$f":"PC_TH*$E149*CF_TDNCXD","v":0},{"$f":"PC_DB*$E149*CF_TDNCXD","v":0},{"$f":"PC_CD*$E149*CF_TDNCXD","v":0},{"$f":"ROUND(SUM(E149:L149)/26,0)","v":0},null,null,null,3.08,3.08]
[null,"NBTT14",null,{"$f":"IF(CF_TDNCXD=0,R150,Q150)","v":3.73},{"$f":"IF(CF_TDNCXD=0,D150*LNC_dauvao,D150*LTTV)","v":0},{"$f":"$F$9*CF_TDNCXD","v":0},{"$f":"PC_LP*$E150*CF_TDNCXD","v":0},{"$f":"PC_K*$E150*CF_TDNCXD","v":0},{"$f":"PC_KODSX*$E150*CF_TDNCXD","v":0},{"$f":"PC_TH*$E150*CF_TDNCXD","v":0},{"$f":"PC_DB*$E150*CF_TDNCXD","v":0},{"$f":"PC_CD*$E150*CF_TDNCXD","v":0},{"$f":"ROUND(SUM(E150:L150)/26,0)","v":0},null,null,null,3.73,3.73]
["2. Thợ máy kiêm cơ khí, thợ bơm"]
[null,"NBCK11",null,{"$f":"IF(CF_TDNCXD=0,R152,Q152)","v":2.5099999999999998},{"$f":"IF(CF_TDNCXD=0,D152*LNC_dauvao,D152*LTTV)","v":0},{"$f":"$F$9*CF_TDNCXD","v":0},{"$f":"PC_LP*$E152*CF_TDNCXD","v":0},{"$f":"PC_K*$E152*CF_TDNCXD","v":0},{"$f":"PC_KODSX*$E152*CF_TDNCXD","v":0},{"$f":"PC_TH*$E152*CF_TDNCXD","v":0},{"$f":"PC_DB*$E152*CF_TDNCXD","v":0},{"$f":"PC_CD*$E152*CF_TDNCXD","v":0},{"$f":"ROUND(SUM(E152:L152)/26,0)","v":0},null,null,null,2.5099999999999998,2.5099999999999998]
[null,"NBCK12",null,{"$f":"IF(CF_TDNCXD=0,R153,Q153)","v":2.93},{"$f":"IF(CF_TDNCXD=0,D153*LNC_dauvao,D153*LTTV)","v":0},{"$f":"$F$9*CF_TDNCXD","v":0},{"$f":"PC_LP*$E153*CF_TDNCXD","v":0},{"$f":"PC_K*$E153*CF_TDNCXD","v":0},{"$f":"PC_KODSX*$E153*CF_TDNCXD","v":0},{"$f":"PC_TH*$E153*CF_TDNCXD","v":0},{"$f":"PC_DB*$E153*CF_TDNCXD","v":0},{"$f":"PC_CD*$E153*CF_TDNCXD","v":0},{"$f":"ROUND(SUM(E153:L153)/26,0)","v":0},null,null,null,2.93,2.93]
[null,"NBCK13",null,{"$f":"IF(CF_TDNCXD=0,R154,Q154)","v":3.49},{"$f":"IF(CF_TDNCXD=0,D154*LNC_dauvao,D154*LTTV)","v":0},{"$f":"$F$9*CF_TDNCXD","v":0},{"$f":"PC_LP*$E154*CF_TDNCXD","v":0},{"$f":"PC_K*$E154*CF_TDNCXD","v":0},{"$f":"PC_KODSX*$E154*CF_TDNCXD","v":0},{"$f":"PC_TH*$E154*CF_TDNCXD","v":0},{"$f":"PC_DB*$E154*CF_TDNCXD","v":0},{"$f":"PC_CD*$E154*CF_TDNCXD","v":0},{"$f":"ROUND(SUM(E154:L154)/26,0)","v":0},null,null,null,3.49,3.49]
[null,"NBCK14",null,{"$f":"IF(CF_TDNCXD=0,R155,Q155)","v":4.16},{"$f":"IF(CF_TDNCXD=0,D155*LNC_dauvao,D155*LTTV)","v":0},{"$f":"$F$9*CF_TDNCXD","v":0},{"$f":"PC_LP*$E155*CF_TDNCXD","v":0},{"$f":"PC_K*$E155*CF_TDNCXD","v":0},{"$f":"PC_KODSX*$E155*CF_TDNCXD","v":0},{"$f":"PC_TH*$E155*CF_TDNCXD","v":0},{"$f":"PC_DB*$E155*CF_TDNCXD","v":0},{"$f":"PC_CD*$E155*CF_TDNCXD","v":0},{"$f":"ROUND(SUM(E155:L155)/26,0)","v":0},null,null,null,4.16,4.16]
["3. Thợ máy, điện, vô tuyến điện"]
[null,"NBTM11",null,{"$f":"IF(CF_TDNCXD=0,R157,Q157)","v":2.35},{"$f":"IF(CF_TDNCXD=0,D157*LNC_dauvao,D157*LTTV)","v":0},{"$f":"$F$9*CF_TDNCXD","v":0},{"$f":"PC_LP*$E157*CF_TDNCXD","v":0},{"$f":"PC_K*$E157*CF_TDNCXD","v":0},{"$f":"PC_KODSX*$E157*CF_TDNCXD","v":0},{"$f":"PC_TH*$E157*CF_TDNCXD","v":0},{"$f":"PC_DB*$E157*CF_TDNCXD","v":0},{"$f":"PC_CD*$E157*CF_TDNCXD","v":0},{"$f":"ROUND(SUM(E157:L157)/26,0)","v":0},null,null,null,2.35,2.35]
[null,"NBTM12",null,{"$f":"IF(CF_TDNCXD=0,R158,Q158)","v":2.72},{"$f":"IF(CF_TDNCXD=0,D158*LNC_dauvao,D158*LTTV)","v":0},{"$f":"$F$9*CF_TDNCXD","v":0},{"$f":"PC_LP*$E158*CF_TDNCXD","v":0},{"$f":"PC_K*$E158*CF_TDNCXD","v":0},{"$f":"PC_KODSX*$E158*CF_TDNCXD","v":0},{"$f":"PC_TH*$E158*CF_TDNCXD","v":0},{"$f":"PC_DB*$E158*CF_TDNCXD","v":0},{"$f":"PC_CD*$E158*CF_TDNCXD","v":0},{"$f":"ROUND(SUM(E158:L158)/26,0)","v":0},null,null,null,2.72,2.72]
[null,"NBTM13",null,{"$f":"IF(CF_TDNCXD=0,R159,Q159)","v":3.25},{"$f":"IF(CF_TDNCXD=0,D159*LNC_dauvao,D159*LTTV)","v":0},{"$f":"$F$9*CF_TDNCXD","v":0},{"$f":"PC_LP*$E159*CF_TDNCXD","v":0},{"$f":"PC_K*$E159*CF_TDNCXD","v":0},{"$f":"PC_KODSX*$E159*CF_TDNCXD","v":0},{"$f":"PC_TH*$E159*CF_TDNCXD","v":0},{"$f":"PC_DB*$E159*CF_TDNCXD","v":0},{"$f":"PC_CD*$E159*CF_TDNCXD","v":0},{"$f":"ROUND(SUM(E159:L159)/26,0)","v":0},null,null,null,3.25,3.25]
[null,"NBTM14",null,{"$f":"IF(CF_TDNCXD=0,R160,Q160)","v":3.91},{"$f":"IF(CF_TDNCXD=0,D160*LNC_dauvao,D160*LTTV)","v":0},{"$f":"$F$9*CF_TDNCXD","v":0},{"$f":"PC_LP*$E160*CF_TDNCXD","v":0},{"$f":"PC_K*$E160*CF_TDNCXD","v":0},{"$f":"PC_KODSX*$E160*CF_TDNCXD","v":0},{"$f":"PC_TH*$E160*CF_TDNCXD","v":0},{"$f":"PC_DB*$E160*CF_TDNCXD","v":0},{"$f":"PC_CD*$E160*CF_TDNCXD","v":0},{"$f":"ROUND(SUM(E160:L160)/26,0)","v":0},null,null,null,3.91,3.91]
["4. Phục vụ viên"]
[null,"NBPV11",null,{"$f":"IF(CF_TDNCXD=0,R162,Q162)","v":1.75},{"$f":"IF(CF_TDNCXD=0,D162*LNC_dauvao,D162*LTTV)","v":0},{"$f":"$F$9*CF_TDNCXD","v":0},{"$f":"PC_LP*$E162*CF_TDNCXD","v":0},{"$f":"PC_K*$E162*CF_TDNCXD","v":0},{"$f":"PC_KODSX*$E162*CF_TDNCXD","v":0},{"$f":"PC_TH*$E162*CF_TDNCXD","v":0},{"$f":"PC_DB*$E162*CF_TDNCXD","v":0},{"$f":"PC_CD*$E162*CF_TDNCXD","v":0},{"$f":"ROUND(SUM(E162:L162)/26,0)","v":0},null,null,null,1.75,1.75]
[null,"NBPV12",null,{"$f":"IF(CF_TDNCXD=0,R163,Q163)","v":1.99},{"$f":"IF(CF_TDNCXD=0,D163*LNC_dauvao,D163*LTTV)","v":0},{"$f":"$F$9*CF_TDNCXD","v":0},{"$f":"PC_LP*$E163*CF_TDNCXD","v":0},{"$f":"PC_K*$E163*CF_TDNCXD","v":0},{"$f":"PC_KODSX*$E163*CF_TDNCXD","v":0},{"$f":"PC_TH*$E163*CF_TDNCXD","v":0},{"$f":"PC_DB*$E163*CF_TDNCXD","v":0},{"$f":"PC_CD*$E163*CF_TDNCXD","v":0},{"$f":"ROUND(SUM(E163:L163)/26,0)","v":0},null,null,null,1.99,1.99]
[null,"NBPV13",null,{"$f":"IF(CF_TDNCXD=0,R164,Q164)","v":2.35},{"$f":"IF(CF_TDNCXD=0,D164*LNC_dauvao,D164*LTTV)","v":0},{"$f":"$F$9*CF_TDNCXD","v":0},{"$f":"PC_LP*$E164*CF_TDNCXD","v":0},{"$f":"PC_K*$E164*CF_TDNCXD","v":0},{"$f":"PC_KODSX*$E164*CF_TDNCXD","v":0},{"$f":"PC_TH*$E164*CF_TDNCXD","v":0},{"$f":"PC_DB*$E164*CF_TDNCXD","v":0},{"$f":"PC_CD*$E164*CF_TDNCXD","v":0},{"$f":"ROUND(SUM(E164:L164)/26,0)","v":0},null,null,null,2.35,2.35]
[null,"NBPV14",null,{"$f":"IF(CF_TDNCXD=0,R165,Q165)","v":2.66},{"$f":"IF(CF_TDNCXD=0,D165*LNC_dauvao,D165*LTTV)","v":0},{"$f":"$F$9*CF_TDNCXD","v":0},{"$f":"PC_LP*$E165*CF_TDNCXD","v":0},{"$f":"PC_K*$E165*CF_TDNCXD","v":0},{"$f":"PC_KODSX*$E165*CF_TDNCXD","v":0},{"$f":"PC_TH*$E165*CF_TDNCXD","v":0},{"$f":"PC_DB*$E165*CF_TDNCXD","v":0},{"$f":"PC_CD*$E165*CF_TDNCXD","v":0},{"$f":"ROUND(SUM(E165:L165)/26,0)","v":0},null,null,null,2.66,2.66]
["5. Cấp dưỡng"]
[null,"NBCD11",null,{"$f":"IF(CF_TDNCXD=0,R167,Q167)","v":1.93},{"$f":"IF(CF_TDNCXD=0,D167*LNC_dauvao,D167*LTTV)","v":0},{"$f":"$F$9*CF_TDNCXD","v":0},{"$f":"PC_LP*$E167*CF_TDNCXD","v":0},{"$f":"PC_K*$E167*CF_TDNCXD","v":0},{"$f":"PC_KODSX*$E167*CF_TDNCXD","v":0},{"$f":"PC_TH*$E167*CF_TDNCXD","v":0},{"$f":"PC_DB*$E167*CF_TDNCXD","v":0},{"$f":"PC_CD*$E167*CF_TDNCXD","v":0},{"$f":"ROUND(SUM(E167:L167)/26,0)","v":0},null,null,null,1.93,1.93]
[null,"NBCD12",null,{"$f":"IF(CF_TDNCXD=0,R168,Q168)","v":2.38},{"$f":"IF(CF_TDNCXD=0,D168*LNC_dauvao,D168*LTTV)","v":0},{"$f":"$F$9*CF_TDNCXD","v":0},{"$f":"PC_LP*$E168*CF_TDNCXD","v":0},{"$f":"PC_K*$E168*CF_TDNCXD","v":0},{"$f":"PC_KODSX*$E168*CF_TDNCXD","v":0},{"$f":"PC_TH*$E168*CF_TDNCXD","v":0},{"$f":"PC_DB*$E168*CF_TDNCXD","v":0},{"$f":"PC_CD*$E168*CF_TDNCXD","v":0},{"$f":"ROUND(SUM(E168:L168)/26,0)","v":0},null,null,null,2.38,2.38]
[null,"NBCD13",null,{"$f":"IF(CF_TDNCXD=0,R169,Q169)","v":2.74},{"$f":"IF(CF_TDNCXD=0,D169*LNC_dauvao,D169*LTTV)","v":0},{"$f":"$F$9*CF_TDNCXD","v":0},{"$f":"PC_LP*$E169*CF_TDNCXD","v":0},{"$f":"PC_K*$E169*CF_TDNCXD","v":0},{"$f":"PC_KODSX*$E169*CF_TDNCXD","v":0},{"$f":"PC_TH*$E169*CF_TDNCXD","v":0},{"$f":"PC_DB*$E169*CF_TDNCXD","v":0},{"$f":"PC_CD*$E169*CF_TDNCXD","v":0},{"$f":"ROUND(SUM(E169:L169)/26,0)","v":0},null,null,null,2.74,2.74]
[null,"NBCD14",null,{"$f":"IF(CF_TDNCXD=0,R170,Q170)","v":3.15},{"$f":"IF(CF_TDNCXD=0,D170*LNC_dauvao,D170*LTTV)","v":0},{"$f":"$F$9*CF_TDNCXD","v":0},{"$f":"PC_LP*$E170*CF_TDNCXD","v":0},{"$f":"PC_K*$E170*CF_TDNCXD","v":0},{"$f":"PC_KODSX*$E170*CF_TDNCXD","v":0},{"$f":"PC_TH*$E170*CF_TDNCXD","v":0},{"$f":"PC_DB*$E170*CF_TDNCXD","v":0},{"$f":"PC_CD*$E170*CF_TDNCXD","v":0},{"$f":"ROUND(SUM(E170:L170)/26,0)","v":0},null,null,null,3.15,3.15]
["II/ Tàu vận tải sông và sang ngang"]
["1. Thuỷ thủ"]
["Nhóm I (vận tải dọc sông)"]
[null,"NDSTT11",null,{"$f":"IF(CF_TDNCXD=0,R174,Q174)","v":1.93},{"$f":"IF(CF_TDNCXD=0,D174*LNC_dauvao,D174*LTTV)","v":0},{"$f":"$F$9*CF_TDNCXD","v":0},{"$f":"PC_LP*$E174*CF_TDNCXD","v":0},{"$f":"PC_K*$E174*CF_TDNCXD","v":0},{"$f":"PC_KODSX*$E174*CF_TDNCXD","v":0},{"$f":"PC_TH*$E174*CF_TDNCXD","v":0},{"$f":"PC_DB*$E174*CF_TDNCXD","v":0},{"$f":"PC_CD*$E174*CF_TDNCXD","v":0},{"$f":"ROUND(SUM(E174:L174)/26,0)","v":0},null,null,null,1.93,1.93]
[null,"NDSTT12",null,{"$f":"IF(CF_TDNCXD=0,R175,Q175)","v":2.1800000000000002},{"$f":"IF(CF_TDNCXD=0,D175*LNC_dauvao,D175*LTTV)","v":0},{"$f":"$F$9*CF_TDNCXD","v":0},{"$f":"PC_LP*$E175*CF_TDNCXD","v":0},{"$f":"PC_K*$E175*CF_TDNCXD","v":0},{"$f":"PC_KODSX*$E175*CF_TDNCXD","v":0},{"$f":"PC_TH*$E175*CF_TDNCXD","v":0},{"$f":"PC_DB*$E175*CF_TDNCXD","v":0},{"$f":"PC_CD*$E175*CF_TDNCXD","v":0},{"$f":"ROUND(SUM(E175:L175)/26,0)","v":0},null,null,null,2.1800000000000002,2.1800000000000002]
[null,"NDSTT13",null,{"$f":"IF(CF_TDNCXD=0,R176,Q176)","v":2.5099999999999998},{"$f":"IF(CF_TDNCXD=0,D176*LNC_dauvao,D176*LTTV)","v":0},{"$f":"$F$9*CF_TDNCXD","v":0},{"$f":"PC_LP*$E176*CF_TDNCXD","v":0},{"$f":"PC_K*$E176*CF_TDNCXD","v":0},{"$f":"PC_KODSX*$E176*CF_TDNCXD","v":0},{"$f":"PC_TH*$E176*CF_TDNCXD","v":0},{"$f":"PC_DB*$E176*CF_TDNCXD","v":0},{"$f":"PC_CD*$E176*CF_TDNCXD","v":0},{"$f":"ROUND(SUM(E176:L176)/26,0)","v":0},null,null,null,2.5099999999999998,2.5099999999999998]
[null,"NDSTT14",null,{"$f":"IF(CF_TDNCXD=0,R177,Q177)","v":2.83},{"$f":"IF(CF_TDNCXD=0,D177*LNC_dauvao,D177*LTTV)","v":0},{"$f":"$F$9*CF_TDNCXD","v":0},{"$f":"PC_LP*$E177*CF_TDNCXD","v":0},{"$f":"PC_K*$E177*CF_TDNCXD","v":0},{"$f":"PC_KODSX*$E177*CF_TDNCXD","v":0},{"$f":"PC_TH*$E177*CF_TDNCXD","v":0},{"$f":"PC_DB*$E177*CF_TDNCXD","v":0},{"$f":"PC_CD*$E177*CF_TDNCXD","v":0},{"$f":"ROUND(SUM(E177:L177)/26,0)","v":0},null,null,null,2.83,2.83]
["Nhóm II (vận tải sang ngang)"]
[null,"NNSTT11",null,{"$f":"IF(CF_TDNCXD=0,R179,Q179)","v":1.93},{"$f":"IF(CF_TDNCXD=0,D179*LNC_dauvao,D179*LTTV)","v":0},{"$f":"$F$9*CF_TDNCXD","v":0},{"$f":"PC_LP*$E179*CF_TDNCXD","v":0},{"$f":"PC_K*$E179*CF_TDNCXD","v":0},{"$f":"PC_KODSX*$E179*CF_TDNCXD","v":0},{"$f":"PC_TH*$E179*CF_TDNCXD","v":0},{"$f":"PC_DB*$E179*CF_TDNCXD","v":0},{"$f":"PC_CD*$E179*CF_TDNCXD","v":0},{"$f":"ROUND(SUM(E179:L179)/26,0)","v":0},null,null,null,2.12,1.93]
[null,"NNSTT12",null,{"$f":"IF(CF_TDNCXD=0,R180,Q180)","v":2.1800000000000002},{"$f":"IF(CF_TDNCXD=0,D180*LNC_dauvao,D180*LTTV)","v":0},{"$f":"$F$9*CF_TDNCXD","v":0},{"$f":"PC_LP*$E180*CF_TDNCXD","v":0},{"$f":"PC_K*$E180*CF_TDNCXD","v":0},{"$f":"PC_KODSX*$E180*CF_TDNCXD","v":0},{"$f":"PC_TH*$E180*CF_TDNCXD","v":0},{"$f":"PC_DB*$E180*CF_TDNCXD","v":0},{"$f":"PC_CD*$E180*CF_TDNCXD","v":0},{"$f":"ROUND(SUM(E180:L180)/26,0)","v":0},null,null,null,2.39,2.1800000000000002]
[null,"NNSTT13",null,{"$f":"IF(CF_TDNCXD=0,R181,Q181)","v":2.5099999999999998},{"$f":"IF(CF_TDNCXD=0,D181*LNC_dauvao,D181*LTTV)","v":0},{"$f":"$F$9*CF_TDNCXD","v":0},{"$f":"PC_LP*$E181*CF_TDNCXD","v":0},{"$f":"PC_K*$E181*CF_TDNCXD","v":0},{"$f":"PC_KODSX*$E181*CF_TDNCXD","v":0},{"$f":"PC_TH*$E181*CF_TDNCXD","v":0},{"$f":"PC_DB*$E181*CF_TDNCXD","v":0},{"$f":"PC_CD*$E181*CF_TDNCXD","v":0},{"$f":"ROUND(SUM(E181:L181)/26,0)","v":0},null,null,null,2.76,2.5099999999999998]
[null,"NNSTT14",null,{"$f":"IF(CF_TDNCXD=0,R182,Q182)","v":2.83},{"$f":"IF(CF_TDNCXD=0,D182*LNC_dauvao,D182*LTTV)","v":0},{"$f":"$F$9*CF_TDNCXD","v":0},{"$f":"PC_LP*$E182*CF_TDNCXD","v":0},{"$f":"PC_K*$E182*CF_TDNCXD","v":0},{"$f":"PC_KODSX*$E182*CF_TDNCXD","v":0},{"$f":"PC_TH*$E182*CF_TDNCXD","v":0},{"$f":"PC_DB*$E182*CF_TDNCXD","v":0},{"$f":"PC_CD*$E182*CF_TDNCXD","v":0},{"$f":"ROUND(SUM(E182:L182)/26,0)","v":0},null,null,null,3.11,2.83]
["2. Thợ máy, thợ điện"]
["Nhóm I (vận tải dọc sông)"]
[null,"NDSTM11",null,{"$f":"IF(CF_TDNCXD=0,R185,Q185)","v":2.0499999999999998},{"$f":"IF(CF_TDNCXD=0,D185*LNC_dauvao,D185*LTTV)","v":0},{"$f":"$F$9*CF_TDNCXD","v":0},{"$f":"PC_LP*$E185*CF_TDNCXD","v":0},{"$f":"PC_K*$E185*CF_TDNCXD","v":0},{"$f":"PC_KODSX*$E185*CF_TDNCXD","v":0},{"$f":"PC_TH*$E185*CF_TDNCXD","v":0},{"$f":"PC_DB*$E185*CF_TDNCXD","v":0},{"$f":"PC_CD*$E185*CF_TDNCXD","v":0},{"$f":"ROUND(SUM(E185:L185)/26,0)","v":0},null,null,null,2.0499999999999998,2.0499999999999998]
[null,"NDSTM12",null,{"$f":"IF(CF_TDNCXD=0,R186,Q186)","v":2.35},{"$f":"IF(CF_TDNCXD=0,D186*LNC_dauvao,D186*LTTV)","v":0},{"$f":"$F$9*CF_TDNCXD","v":0},{"$f":"PC_LP*$E186*CF_TDNCXD","v":0},{"$f":"PC_K*$E186*CF_TDNCXD","v":0},{"$f":"PC_KODSX*$E186*CF_TDNCXD","v":0},{"$f":"PC_TH*$E186*CF_TDNCXD","v":0},{"$f":"PC_DB*$E186*CF_TDNCXD","v":0},{"$f":"PC_CD*$E186*CF_TDNCXD","v":0},{"$f":"ROUND(SUM(E186:L186)/26,0)","v":0},null,null,null,2.35,2.35]
[null,"NDSTM13",null,{"$f":"IF(CF_TDNCXD=0,R187,Q187)","v":2.66},{"$f":"IF(CF_TDNCXD=0,D187*LNC_dauvao,D187*LTTV)","v":0},{"$f":"$F$9*CF_TDNCXD","v":0},{"$f":"PC_LP*$E187*CF_TDNCXD","v":0},{"$f":"PC_K*$E187*CF_TDNCXD","v":0},{"$f":"PC_KODSX*$E187*CF_TDNCXD","v":0},{"$f":"PC_TH*$E187*CF_TDNCXD","v":0},{"$f":"PC_DB*$E187*CF_TDNCXD","v":0},{"$f":"PC_CD*$E187*CF_TDNCXD","v":0},{"$f":"ROUND(SUM(E187:L187)/26,0)","v":0},null,null,null,2.66,2.66]
[null,"NDSTM14",null,{"$f":"IF(CF_TDNCXD=0,R188,Q188)","v":2.99},{"$f":"IF(CF_TDNCXD=0,D188*LNC_dauvao,D188*LTTV)","v":0},{"$f":"$F$9*CF_TDNCXD","v":0},{"$f":"PC_LP*$E188*CF_TDNCXD","v":0},{"$f":"PC_K*$E188*CF_TDNCXD","v":0},{"$f":"PC_KODSX*$E188*CF_TDNCXD","v":0},{"$f":"PC_TH*$E188*CF_TDNCXD","v":0},{"$f":"PC_DB*$E188*CF_TDNCXD","v":0},{"$f":"PC_CD*$E188*CF_TDNCXD","v":0},{"$f":"ROUND(SUM(E188:L188)/26,0)","v":0},null,null,null,2.99,2.99]
["Nhóm II (vận tải sang ngang)"]
[null,"NNSTM11",null,{"$f":"IF(CF_TDNCXD=0,R190,Q190)","v":2.0499999999999998},{"$f":"IF(CF_TDNCXD=0,D190*LNC_dauvao,D190*LTTV)","v":0},{"$f":"$F$9*CF_TDNCXD","v":0},{"$f":"PC_LP*$E190*CF_TDNCXD","v":0},{"$f":"PC_K*$E190*CF_TDNCXD","v":0},{"$f":"PC_KODSX*$E190*CF_TDNCXD","v":0},{"$f":"PC_TH*$E190*CF_TDNCXD","v":0},{"$f":"PC_DB*$E190*CF_TDNCXD","v":0},{"$f":"PC_CD*$E190*CF_TDNCXD","v":0},{"$f":"ROUND(SUM(E190:L190)/26,0)","v":0},null,null,null,2.25,2.0499999999999998]
[null,"NNSTM12",null,{"$f":"IF(CF_TDNCXD=0,R191,Q191)","v":2.35},{"$f":"IF(CF_TDNCXD=0,D191*LNC_dauvao,D191*LTTV)","v":0},{"$f":"$F$9*CF_TDNCXD","v":0},{"$f":"PC_LP*$E191*CF_TDNCXD","v":0},{"$f":"PC_K*$E191*CF_TDNCXD","v":0},{"$f":"PC_KODSX*$E191*CF_TDNCXD","v":0},{"$f":"PC_TH*$E191*CF_TDNCXD","v":0},{"$f":"PC_DB*$E191*CF_TDNCXD","v":0},{"$f":"PC_CD*$E191*CF_TDNCXD","v":0},{"$f":"ROUND(SUM(E191:L191)/26,0)","v":0},null,null,null,2.58,2.35]
[null,"NNSTM13",null,{"$f":"IF(CF_TDNCXD=0,R192,Q192)","v":2.66},{"$f":"IF(CF_TDNCXD=0,D192*LNC_dauvao,D192*LTTV)","v":0},{"$f":"$F$9*CF_TDNCXD","v":0},{"$f":"PC_LP*$E192*CF_TDNCXD","v":0},{"$f":"PC_K*$E192*CF_TDNCXD","v":0},{"$f":"PC_KODSX*$E192*CF_TDNCXD","v":0},{"$f":"PC_TH*$E192*CF_TDNCXD","v":0},{"$f":"PC_DB*$E192*CF_TDNCXD","v":0},{"$f":"PC_CD*$E192*CF_TDNCXD","v":0},{"$f":"ROUND(SUM(E192:L192)/26,0)","v":0},null,null,null,2.92,2.66]
[null,"NNSTM14",null,{"$f":"IF(CF_TDNCXD=0,R193,Q193)","v":2.99},{"$f":"IF(CF_TDNCXD=0,D193*LNC_dauvao,D193*LTTV)","v":0},{"$f":"$F$9*CF_TDNCXD","v":0},{"$f":"PC_LP*$E193*CF_TDNCXD","v":0},{"$f":"PC_K*$E193*CF_TDNCXD","v":0},{"$f":"PC_KODSX*$E193*CF_TDNCXD","v":0},{"$f":"PC_TH*$E193*CF_TDNCXD","v":0},{"$f":"PC_DB*$E193*CF_TDNCXD","v":0},{"$f":"PC_CD*$E193*CF_TDNCXD","v":0},{"$f":"ROUND(SUM(E193:L193)/26,0)","v":0},null,null,null,3.28,2.99]
["3. Phục vụ viên"]
[null,"NSPV11",null,{"$f":"IF(CF_TDNCXD=0,R195,Q195)","v":1.55},{"$f":"IF(CF_TDNCXD=0,D195*LNC_dauvao,D195*LTTV)","v":0},{"$f":"$F$9*CF_TDNCXD","v":0},{"$f":"PC_LP*$E195*CF_TDNCXD","v":0},{"$f":"PC_K*$E195*CF_TDNCXD","v":0},{"$f":"PC_KODSX*$E195*CF_TDNCXD","v":0},{"$f":"PC_TH*$E195*CF_TDNCXD","v":0},{"$f":"PC_DB*$E195*CF_TDNCXD","v":0},{"$f":"PC_CD*$E195*CF_TDNCXD","v":0},{"$f":"ROUND(SUM(E195:L195)/26,0)","v":0},null,null,null,1.55,1.55]
[null,"NSPV12",null,{"$f":"IF(CF_TDNCXD=0,R196,Q196)","v":1.75},{"$f":"IF(CF_TDNCXD=0,D196*LNC_dauvao,D196*LTTV)","v":0},{"$f":"$F$9*CF_TDNCXD","v":0},{"$f":"PC_LP*$E196*CF_TDNCXD","v":0},{"$f":"PC_K*$E196*CF_TDNCXD","v":0},{"$f":"PC_KODSX*$E196*CF_TDNCXD","v":0},{"$f":"PC_TH*$E196*CF_TDNCXD","v":0},{"$f":"PC_DB*$E196*CF_TDNCXD","v":0},{"$f":"PC_CD*$E196*CF_TDNCXD","v":0},{"$f":"ROUND(SUM(E196:L196)/26,0)","v":0},null,null,null,1.75,1.75]
[null,"NSPV13",null,{"$f":"IF(CF_TDNCXD=0,R197,Q197)","v":2.0499999999999998},{"$f":"IF(CF_TDNCXD=0,D197*LNC_dauvao,D197*LTTV)","v":0},{"$f":"$F$9*CF_TDNCXD","v":0},{"$f":"PC_LP*$E197*CF_TDNCXD","v":0},{"$f":"PC_K*$E197*CF_TDNCXD","v":0},{"$f":"PC_KODSX*$E197*CF_TDNCXD","v":0},{"$f":"PC_TH*$E197*CF_TDNCXD","v":0},{"$f":"PC_DB*$E197*CF_TDNCXD","v":0},{"$f":"PC_CD*$E197*CF_TDNCXD","v":0},{"$f":"ROUND(SUM(E197:L197)/26,0)","v":0},null,null,null,2.0499999999999998,2.0499999999999998]
[null,"NSPV14",null,{"$f":"IF(CF_TDNCXD=0,R198,Q198)","v":2.35},{"$f":"IF(CF_TDNCXD=0,D198*LNC_dauvao,D198*LTTV)","v":0},{"$f":"$F$9*CF_TDNCXD","v":0},{"$f":"PC_LP*$E198*CF_TDNCXD","v":0},{"$f":"PC_K*$E198*CF_TDNCXD","v":0},{"$f":"PC_KODSX*$E198*CF_TDNCXD","v":0},{"$f":"PC_TH*$E198*CF_TDNCXD","v":0},{"$f":"PC_DB*$E198*CF_TDNCXD","v":0},{"$f":"PC_CD*$E198*CF_TDNCXD","v":0},{"$f":"ROUND(SUM(E198:L198)/26,0)","v":0},null,null,null,2.35,2.35]
[]
["Các chức danh quản lý vận hành luồng tàu biển VTS vận dụng xếp như Kiểm soát viên không lưu Bảng lương công nhân viên Hàng không dân dụng (B.8):"]
[" - Kiểm soát viên từ phao số 0 vào cảng toàn tuyến xếp như Kiểm soát viên không lưu cấp III."]
[" - Kiểm soát viên quản lý vận hành luồng tàu xếp như Kiểm soát viên không lưu cấp II."]
[" - Kiểm soát viên quản lý vận hành khu vực luồng tàu xếp như Kiểm soát viên không lưu cấp I."]
["B.2. BẢNG LƯƠNG THUYỀN VIÊN VÀ CÔNG NHÂN VIÊN TÀU VẬN TẢI BIỂN, VẬN TẢI SÔNG, TÀU DỊCH VỤ DẦU KHÍ, TÀU CẨU DẦU KHÍ (TIẾP THEO)"]
["B.2.I.3. Tàu vận tải sông theo nhóm tàu"]
["CHỨC DANH THEO NHÓM TÀU"]
["1. Thuyền trưởng"]
[null,"NVTTT11","Nhóm I",{"$f":"IF(CF_TDNCXD=0,R208,Q208)","v":2.81},{"$f":"IF(CF_TDNCXD=0,D208*LNC_dauvao,D208*LTTV)","v":0},{"$f":"$F$9*CF_TDNCXD","v":0},{"$f":"PC_LP*$E208*CF_TDNCXD","v":0},{"$f":"PC_K*$E208*CF_TDNCXD","v":0},{"$f":"PC_KODSX*$E208*CF_TDNCXD","v":0},{"$f":"PC_TH*$E208*CF_TDNCXD","v":0},{"$f":"PC_DB*$E208*CF_TDNCXD","v":0},{"$f":"PC_CD*$E208*CF_TDNCXD","v":0},{"$f":"ROUND(SUM(E208:L208)/26,0)","v":0},null,null,null,2.81,2.81]
[null,"NVTTT12",null,2.99,0,0,0,0,0,0,0,0,0,null,null,null,2.99,2.99]
[null,"NVTTT21","Nhóm II",3.73,0,0,0,0,0,0,0,0,0,null,null,null,3.73,3.73]
[null,"NVTTT22",null,3.91,0,0,0,0,0,0,0,0,0,null,null,null,3.91,3.91]
[null,"NVTTT31","Nhóm III",4.1399999999999997,0,0,0,0,0,0,0,0,0,null,null,null,4.1399999999999997,4.1399999999999997]
[null,"NVTTT32",null,4.3600000000000003,0,0,0,0,0,0,0,0,0,null,null,null,4.3600000000000003,4.3600000000000003]
[null,"NVTTT41","Nhóm IV",4.68,0,0,0,0,0,0,0,0,0,null,null,null,4.68,4.68]
[null,"NVTTT42",null,4.92,0,0,0,0,0,0,0,0,0,null,null,null,4.92,4.92]
["2. Đại phó, máy trưởng"]
[null,"NVTDP11","Nhóm I",{"$f":"IF(CF_TDNCXD=0,R217,Q217)","v":2.5099999999999998},{"$f":"IF(CF_TDNCXD=0,D217*LNC_dauvao,D217*LTTV)","v":0},{"$f":"$F$9*CF_TDNCXD","v":0},{"$f":"PC_LP*$E217*CF_TDNCXD","v":0},{"$f":"PC_K*$E217*CF_TDNCXD","v":0},{"$f":"PC_KODSX*$E217*CF_TDNCXD","v":0},{"$f":"PC_TH*$E217*CF_TDNCXD","v":0},{"$f":"PC_DB*$E217*CF_TDNCXD","v":0},{"$f":"PC_CD*$E217*CF_TDNCXD","v":0},{"$f":"ROUND(SUM(E217:L217)/26,0)","v":0},null,null,null,2.5099999999999998,2.5099999999999998]
[null,"NVTDP12",null,2.66,0,0,0,0,0,0,0,0,0,null,null,null,2.66,2.66]
[null,"NVTDP21","Nhóm II",3.17,0,0,0,0,0,0,0,0,0,null,null,null,3.17,3.17]
[null,"NVTDP22",null,3.3,0,0,0,0,0,0,0,0,0,null,null,null,3.3,3.3]
[null,"NVTDP31","Nhóm III",3.55,0,0,0,0,0,0,0,0,0,null,null,null,3.55,3.55]
[null,"NVTDP32",null,3.76,0,0,0,0,0,0,0,0,0,null,null,null,3.76,3.76]
[null,"NVTDP41","Nhóm IV",4.16,0,0,0,0,0,0,0,0,0,null,null,null,4.16,4.16]
[null,"NVTDP42",null,4.37,0,0,0,0,0,0,0,0,0,null,null,null,4.37,4.37]
["3. Thuyền phó 2, máy 2"]
[null,"NVTTP11","Nhóm I"]
[null,"NVTTP12"]
[null,"NVTTP21","Nhóm II",{"$f":"IF(CF_TDNCXD=0,R228,Q228)","v":2.66},{"$f":"IF(CF_TDNCXD=0,D228*LNC_dauvao,D228*LTTV)","v":0},{"$f":"$F$9*CF_TDNCXD","v":0},{"$f":"PC_LP*$E228*CF_TDNCXD","v":0},{"$f":"PC_K*$E228*CF_TDNCXD","v":0},{"$f":"PC_KODSX*$E228*CF_TDNCXD","v":0},{"$f":"PC_TH*$E228*CF_TDNCXD","v":0},{"$f":"PC_DB*$E228*CF_TDNCXD","v":0},{"$f":"PC_CD*$E228*CF_TDNCXD","v":0},{"$f":"ROUND(SUM(E228:L228)/26,0)","v":0},null,null,null,2.66,2.66]
[null,"NVTTP22",null,2.81,0,0,0,0,0,0,0,0,0,null,null,null,2.81,2.81]
[null,"NVTTP31","Nhóm III",2.93,0,0,0,0,0,0,0,0,0,null,null,null,2.93,2.93]
[null,"NVTTP32",null,3.1,0,0,0,0,0,0,0,0,0,null,null,null,3.1,3.1]
[null,"NVTTP41","Nhóm IV",3.55,0,0,0,0,0,0,0,0,0,null,null,null,3.55,3.55]
[null,"NVTTP42",null,3.76,0,0,0,0,0,0,0,0,0,null,null,null,3.76,3.76]
["Nhóm I: Phương tiện không có động cơ có trọng tải toàn phần từ 5 tấn đến 15 tấn; phương tiện có trọng tải động cơ có công suất máy chính từ 5 mã lực"]
["đến 15 mã lực hoặc sức chở từ 5 người đến 12 người."]
["Nhóm II: Tàu khách có sức chở từ trên 12 người đến 50 người; phà có trọng tải toàn phần đến 50 tấn; đoàn lai có trọng tải toàn phần đến 400 tấn;"]
["phương tiện có tổng công suất máy chính từ trên 15 mã lực đến 150 mã lực."]
["Nhóm III: Tàu khách có sức chở từ trên 50 người đến 100 người; phà có trọng tải toàn phần trên 50 tấn đến 150 tấn; phương tiện chở hàng có trọng tải"]
["toàn phần trên 150 tấn đến 500 tấn; đoàn lai có trọng tải toàn phần trên 400 tấn đến đồng tấn; phương tiện"]
["Nhóm IV: Tàu khách có sức chở trên 100 người; phà có trọng tải toàn phần trên 150 tấn; phương tiện chở hàng có trọng tải toàn phần trên 500 tấn;"]
["đoàn lai có trọng tải toàn phần trên đồng tấn; phương tiện có tổng công suất máy chính trên 400 mã lực."]
["B.5. BẢNG LƯƠNG THUYỀN VIÊN VÀ CÔNG NHÂN VIÊN TÀU CÔNG TRÌNH, TÀU TRỤC VỚT VÀ CỨU HỘ, TÀU THAY THẢ PHAO, TÀU TÌM KIẾM CỨU NẠN"]
["HÀNG HẢI (TIẾP THEO)"]
["B.5.I. TÀU CÔNG TRÌNH"]
["2/ Tàu nạo vét sông"]
["CHỨC DANH THEO NHÓM TÀU"]
["1. Thuyền trưởng"]
["Tàu hút dưới 150m3/h",null,null,{"$f":"IF(CF_TDNCXD=0,R248,Q248)","v":0},null,null,{"$f":"PC_LP*$E248*CF_TDNCXD","v":0},{"$f":"PC_K*$E248*CF_TDNCXD","v":0},{"$f":"PC_KODSX*$E248*CF_TDNCXD","v":0},{"$f":"PC_TH*$E248*CF_TDNCXD","v":0},{"$f":"PC_DB*$E248*CF_TDNCXD","v":0},{"$f":"PC_CD*$E248*CF_TDNCXD","v":0}]
[null,"NCTTT11",null,3.91,{"$f":"IF(CF_TDNCXD=0,D249*LNC_dauvao,D249*LTTV)","v":0},{"$f":"$F$9*CF_TDNCXD","v":0},0,0,0,0,0,0,{"$f":"ROUND(SUM(E249:L249)/26,0)","v":0},null,null,null,3.91,3.91]
[null,"NCTTT12",null,4.16,{"$f":"IF(CF_TDNCXD=0,D250*LNC_dauvao,D250*LTTV)","v":0},{"$f":"$F$9*CF_TDNCXD","v":0},0,0,0,0,0,0,{"$f":"ROUND(SUM(E250:L250)/26,0)","v":0},null,null,null,4.16,4.16]
["Tàu hút từ 150m3/h đến 300m3/h",null,null,0,null,null,0,0,0,0,0,0]
[null,"NCTTT21",null,4.37,{"$f":"IF(CF_TDNCXD=0,D252*LNC_dauvao,D252*LTTV)","v":0},{"$f":"$F$9*CF_TDNCXD","v":0},0,0,0,0,0,0,{"$f":"ROUND(SUM(E252:L252)/26,0)","v":0},null,null,null,4.37,4.37]
[null,"NCTTT22",null,4.68,{"$f":"IF(CF_TDNCXD=0,D253*LNC_dauvao,D253*LTTV)","v":0},{"$f":"$F$9*CF_TDNCXD","v":0},0,0,0,0,0,0,{"$f":"ROUND(SUM(E253:L253)/26,0)","v":0},null,null,null,4.68,4.68]
["Tàu hút trên 300m3/h, tàu cuốc dưới 300m3/h",null,null,0,null,null,0,0,0,0,0,0]
[null,"NCTTT31",null,4.88,{"$f":"IF(CF_TDNCXD=0,D255*LNC_dauvao,D255*LTTV)","v":0},{"$f":"$F$9*CF_TDNCXD","v":0},0,0,0,0,0,0,{"$f":"ROUND(SUM(E255:L255)/26,0)","v":0},null,null,null,4.88,4.88]
[null,"NCTTT32",null,5.19,{"$f":"IF(CF_TDNCXD=0,D256*LNC_dauvao,D256*LTTV)","v":0},{"$f":"$F$9*CF_TDNCXD","v":0},0,0,0,0,0,0,{"$f":"ROUND(SUM(E256:L256)/26,0)","v":0},null,null,null,5.19,5.19]
["2. Máy trưởng",null,null,0,null,null,0,0,0,0,0,0]
[null,"NCTMT11",null,3.5,{"$f":"IF(CF_TDNCXD=0,D258*LNC_dauvao,D258*LTTV)","v":0},{"$f":"$F$9*CF_TDNCXD","v":0},0,0,0,0,0,0,{"$f":"ROUND(SUM(E258:L258)/26,0)","v":0},null,null,null,3.5,3.5]
[null,"NCTMT12",null,3.73,0,0,0,0,0,0,0,0,0,null,null,null,3.73,3.73]
[null,"NCTMT13",null,4.16,0,0,0,0,0,0,0,0,0,null,null,null,4.16,4.16]
[null,"NCTMT14",null,4.37,0,0,0,0,0,0,0,0,0,null,null,null,4.37,4.37]
[null,"NCTMT15",null,4.71,0,0,0,0,0,0,0,0,0,null,null,null,4.71,4.71]
[null,"NCTMT16",null,5.07,0,0,0,0,0,0,0,0,0,null,null,null,5.07,5.07]
["3. Điện trưởng",null,null,0,null,null,0,0,0,0,0,0]
["Tàu hút trên 300m3/h. Tàu cuốc dưới 300m3/h",null,null,0,null,null,0,0,0,0,0,0]
[null,"NCTDT11",null,4.16,{"$f":"IF(CF_TDNCXD=0,D266*LNC_dauvao,D266*LTTV)","v":0},{"$f":"$F$9*CF_TDNCXD","v":0},0,0,0,0,0,0,{"$f":"ROUND(SUM(E266:L266)/26,0)","v":0},null,null,null,4.16,4.16]
[null,"NCTDT12",null,4.3600000000000003,{"$f":"IF(CF_TDNCXD=0,D267*LNC_dauvao,D267*LTTV)","v":0},{"$f":"$F$9*CF_TDNCXD","v":0},0,0,0,0,0,0,{"$f":"ROUND(SUM(E267:L267)/26,0)","v":0},null,null,null,4.3600000000000003,4.3600000000000003]
["4. Máy 2, kỹ thuật viên cuốc 1",null,null,0,null,null,0,0,0,0,0,0]
[null,"NCTM211",null,3.48,{"$f":"IF(CF_TDNCXD=0,D269*LNC_dauvao,D269*LTTV)","v":0},{"$f":"$F$9*CF_TDNCXD","v":0},0,0,0,0,0,0,{"$f":"ROUND(SUM(E269:L269)/26,0)","v":0},null,null,null,3.48,3.48]
[null,"NCTM212",null,3.71,0,0,0,0,0,0,0,0,0,null,null,null,3.71,3.71]
[null,"NCTM213",null,4.09,0,0,0,0,0,0,0,0,0,null,null,null,4.09,4.09]
[null,"NCTM214",null,4.3,0,0,0,0,0,0,0,0,0,null,null,null,4.3,4.3]
[null,"NCTM215",null,4.68,0,0,0,0,0,0,0,0,0,null,null,null,4.68,4.68]
[null,"NCTM216",null,4.92,0,0,0,0,0,0,0,0,0,null,null,null,4.92,4.92]
["5. Máy 3, kỹ thuật viên cuốc 2",null,null,0,null,null,0,0,0,0,0,0]
[null,"NCTM311",null,3.17,{"$f":"IF(CF_TDNCXD=0,D276*LNC_dauvao,D276*LTTV)","v":0},{"$f":"$F$9*CF_TDNCXD","v":0},0,0,0,0,0,0,{"$f":"ROUND(SUM(E276:L276)/26,0)","v":0},null,null,null,3.17,3.17]
[null,"NCTM312",null,3.5,0,0,0,0,0,0,0,0,0,null,null,null,3.5,3.5]
[null,"NCTM313",null,3.73,0,0,0,0,0,0,0,0,0,null,null,null,3.73,3.73]
[null,"NCTM314",null,3.91,0,0,0,0,0,0,0,0,0,null,null,null,3.91,3.91]
[null,"NCTM315",null,{"$f":"IF(CF_TDNCXD=0,R280,Q280)","v":4.37},0,0,{"$f":"PC_LP*$E280*CF_TDNCXD","v":0},{"$f":"PC_K*$E280*CF_TDNCXD","v":0},{"$f":"PC_KODSX*$E280*CF_TDNCXD","v":0},{"$f":"PC_TH*$E280*CF_TDNCXD","v":0},{"$f":"PC_DB*$E280*CF_TDNCXD","v":0},{"$f":"PC_CD*$E280*CF_TDNCXD","v":0},0,null,null,null,4.37,4.37]
[null,"NCTM316",null,4.68,0,0,0,0,0,0,0,0,0,null,null,null,4.68,4.68]
["6. Máy 4, kỹ thuật viên cuốc 3",null,null,0,null,null,0,0,0,0,0,0]
[null,"NCTM411",null,4.16,{"$f":"IF(CF_TDNCXD=0,D283*LNC_dauvao,D283*LTTV)","v":0},{"$f":"$F$9*CF_TDNCXD","v":0},0,0,0,0,0,0,{"$f":"ROUND(SUM(E283:L283)/26,0)","v":0},null,null,null,4.16,4.16]
[null,"NCTM412",null,4.3600000000000003,{"$f":"IF(CF_TDNCXD=0,D284*LNC_dauvao,D284*LTTV)","v":0},{"$f":"$F$9*CF_TDNCXD","v":0},0,0,0,0,0,0,{"$f":"ROUND(SUM(E284:L284)/26,0)","v":0},null,null,null,4.3600000000000003,4.3600000000000003]
["7. Quản trị trưởng, thuỷ thủ trưởng",null,null,0,null,null,0,0,0,0,0,0]
[null,"NCQTT11",null,3.5,{"$f":"IF(CF_TDNCXD=0,D286*LNC_dauvao,D286*LTTV)","v":0},{"$f":"$F$9*CF_TDNCXD","v":0},0,0,0,0,0,0,{"$f":"ROUND(SUM(E286:L286)/26,0)","v":0},null,null,null,3.5,3.5]
[null,"NCQTT12",null,3.73,{"$f":"IF(CF_TDNCXD=0,D287*LNC_dauvao,D287*LTTV)","v":0},{"$f":"$F$9*CF_TDNCXD","v":0},0,0,0,0,0,0,{"$f":"ROUND(SUM(E287:L287)/26,0)","v":0},null,null,null,3.73,3.73]
["CHỨC DANH KHÔNG THEO NHÓM TÀU",null,null,0,null,null,0,0,0,0,0,0]
["1. Thợ máy, điện, điện báo",null,null,0,null,null,0,0,0,0,0,0]
[null,"NTM11","1/4",2.0499999999999998,{"$f":"IF(CF_TDNCXD=0,D290*LNC_dauvao,D290*LTTV)","v":0},{"$f":"$F$9*CF_TDNCXD","v":0},0,0,0,0,0,0,{"$f":"ROUND(SUM(E290:L290)/26,0)","v":0},null,null,null,2.0499999999999998,2.0499999999999998]
[null,"NTM12","2/4",2.35,{"$f":"IF(CF_TDNCXD=0,D291*LNC_dauvao,D291*LTTV)","v":0},{"$f":"$F$9*CF_TDNCXD","v":0},0,0,0,0,0,0,{"$f":"ROUND(SUM(E291:L291)/26,0)","v":0},null,null,null,2.35,2.35]
[null,"NTM13","3/4",2.66,{"$f":"IF(CF_TDNCXD=0,D292*LNC_dauvao,D292*LTTV)","v":0},{"$f":"$F$9*CF_TDNCXD","v":0},0,0,0,0,0,0,{"$f":"ROUND(SUM(E292:L292)/26,0)","v":0},null,null,null,2.66,2.66]
[null,"NTM14","4/4",2.99,{"$f":"IF(CF_TDNCXD=0,D293*LNC_dauvao,D293*LTTV)","v":0},{"$f":"$F$9*CF_TDNCXD","v":0},0,0,0,0,0,0,{"$f":"ROUND(SUM(E293:L293)/26,0)","v":0},null,null,null,2.99,2.99]
["2. Thuỷ thủ",null,null,0,null,null,0,0,0,0,0,0]
[null,"NTT11","1/4",1.93,{"$f":"IF(CF_TDNCXD=0,D295*LNC_dauvao,D295*LTTV)","v":0},{"$f":"$F$9*CF_TDNCXD","v":0},0,0,0,0,0,0,{"$f":"ROUND(SUM(E295:L295)/26,0)","v":0},null,null,null,1.93,1.93]
[null,"NTT12","2/4",2.1800000000000002,{"$f":"IF(CF_TDNCXD=0,D296*LNC_dauvao,D296*LTTV)","v":0},{"$f":"$F$9*CF_TDNCXD","v":0},0,0,0,0,0,0,{"$f":"ROUND(SUM(E296:L296)/26,0)","v":0},null,null,null,2.1800000000000002,2.1800000000000002]
[null,"NTT13","3/4",2.5099999999999998,{"$f":"IF(CF_TDNCXD=0,D297*LNC_dauvao,D297*LTTV)","v":0},{"$f":"$F$9*CF_TDNCXD","v":0},0,0,0,0,0,0,{"$f":"ROUND(SUM(E297:L297)/26,0)","v":0},null,null,null,2.5099999999999998,2.5099999999999998]
[null,"NTT14","4/4",2.83,{"$f":"IF(CF_TDNCXD=0,D298*LNC_dauvao,D298*LTTV)","v":0},{"$f":"$F$9*CF_TDNCXD","v":0},0,0,0,0,0,0,{"$f":"ROUND(SUM(E298:L298)/26,0)","v":0},null,null,null,2.83,2.83]
["3. Phục vụ viên",null,null,0,null,null,0,0,0,0,0,0]
[null,"NPV11","1/4",1.55,{"$f":"IF(CF_TDNCXD=0,D300*LNC_dauvao,D300*LTTV)","v":0},{"$f":"$F$9*CF_TDNCXD","v":0},0,0,0,0,0,0,{"$f":"ROUND(SUM(E300:L300)/26,0)","v":0},null,null,null,1.55,1.55]
[null,"NPV12","2/4",1.75,{"$f":"IF(CF_TDNCXD=0,D301*LNC_dauvao,D301*LTTV)","v":0},{"$f":"$F$9*CF_TDNCXD","v":0},0,0,0,0,0,0,{"$f":"ROUND(SUM(E301:L301)/26,0)","v":0},null,null,null,1.75,1.75]
[null,"NPV13","2,7/4",1.96,{"$f":"IF(CF_TDNCXD=0,D302*LNC_dauvao,D302*LTTV)","v":0},{"$f":"$F$9*CF_TDNCXD","v":0},0,0,0,0,0,0,{"$f":"ROUND(SUM(E302:L302)/26,0)","v":0},null,null,null,1.96,1.96]
[null,"NPV14","3/4",2.0499999999999998,{"$f":"IF(CF_TDNCXD=0,D303*LNC_dauvao,D303*LTTV)","v":0},{"$f":"$F$9*CF_TDNCXD","v":0},0,0,0,0,0,0,{"$f":"ROUND(SUM(E303:L303)/26,0)","v":0},null,null,null,2.0499999999999998,2.0499999999999998]
[null,null,"4/4",2.35,{"$f":"IF(CF_TDNCXD=0,D304*LNC_dauvao,D304*LTTV)","v":0},{"$f":"$F$9*CF_TDNCXD","v":0},0,0,0,0,0,0,{"$f":"ROUND(SUM(E304:L304)/26,0)","v":0},null,null,null,2.35,2.35]
["4. Cấp dưỡng",null,null,0,null,null,0,0,0,0,0,0]
[null,"NCD11","1/4",1.75,{"$f":"IF(CF_TDNCXD=0,D306*LNC_dauvao,D306*LTTV)","v":0},{"$f":"$F$9*CF_TDNCXD","v":0},0,0,0,0,0,0,{"$f":"ROUND(SUM(E306:L306)/26,0)","v":0},null,null,null,1.75,1.75]
[null,"NCD12","2/4",1.99,{"$f":"IF(CF_TDNCXD=0,D307*LNC_dauvao,D307*LTTV)","v":0},{"$f":"$F$9*CF_TDNCXD","v":0},0,0,0,0,0,0,{"$f":"ROUND(SUM(E307:L307)/26,0)","v":0},null,null,null,1.99,1.99]
[null,"NCD13","3/4",2.35,{"$f":"IF(CF_TDNCXD=0,D308*LNC_dauvao,D308*LTTV)","v":0},{"$f":"$F$9*CF_TDNCXD","v":0},0,0,0,0,0,0,{"$f":"ROUND(SUM(E308:L308)/26,0)","v":0},null,null,null,2.35,2.35]
[null,"NCD14","4/4",2.66,{"$f":"IF(CF_TDNCXD=0,D309*LNC_dauvao,D309*LTTV)","v":0},{"$f":"$F$9*CF_TDNCXD","v":0},0,0,0,0,0,0,{"$f":"ROUND(SUM(E309:L309)/26,0)","v":0},null,null,null,2.66,2.66]
["B.5. BẢNG LƯƠNG THUYỀN VIÊN VÀ CÔNG NHÂN VIÊN TÀU CÔNG TRÌNH, TÀU TRỤC VỚT VÀ CỨU HỘ, TÀU THAY THẢ PHAO, TÀU TÌM KIẾM CỨU NẠN",null,null,0,null,null,0,0,0,0,0,0]
[" HÀNG HẢI",null,null,0,null,null,0,0,0,0,0,0]
["I/ Tàu công trình"]
["1/ Tàu nạo vét biển "]
["CHỨC DANH THEO NHÓM TÀU"]
["1. Thuyền trưởng tàu hút bụng"]
["Tàu hút. tàu cuốc từ 300m3/h đến dưới 800m3/h"]
[null,"NVBTT11",null,{"$f":"IF(CF_TDNCXD=0,R317,Q317)","v":5.19},{"$f":"IF(CF_TDNCXD=0,D317*LNC_dauvao,D317*LTTV)","v":0},{"$f":"$F$9*CF_TDNCXD","v":0},{"$f":"PC_LP*$E317*CF_TDNCXD","v":0},{"$f":"PC_K*$E317*CF_TDNCXD","v":0},{"$f":"PC_KODSX*$E317*CF_TDNCXD","v":0},{"$f":"PC_TH*$E317*CF_TDNCXD","v":0},{"$f":"PC_DB*$E317*CF_TDNCXD","v":0},{"$f":"PC_CD*$E317*CF_TDNCXD","v":0},{"$f":"ROUND(SUM(E317:L317)/26,0)","v":0},null,null,null,5.19,5.19]
[null,"NVBTT12",null,5.41,{"$f":"IF(CF_TDNCXD=0,D318*LNC_dauvao,D318*LTTV)","v":0},{"$f":"$F$9*CF_TDNCXD","v":0},0,0,0,0,0,0,{"$f":"ROUND(SUM(E318:L318)/26,0)","v":0},null,null,null,5.41,5.41]
["Tàu hút. tàu cuốc từ 800m3/h trở lên"]
[null,"NVBTT13",null,5.41,{"$f":"IF(CF_TDNCXD=0,D320*LNC_dauvao,D320*LTTV)","v":0},{"$f":"$F$9*CF_TDNCXD","v":0},0,0,0,0,0,0,{"$f":"ROUND(SUM(E320:L320)/26,0)","v":0},null,null,null,5.41,5.41]
[null,"NVBTT14",null,5.75,{"$f":"IF(CF_TDNCXD=0,D321*LNC_dauvao,D321*LTTV)","v":0},{"$f":"$F$9*CF_TDNCXD","v":0},0,0,0,0,0,0,{"$f":"ROUND(SUM(E321:L321)/26,0)","v":0},null,null,null,5.75,5.75]
["2. Máy trưởng, thuyền trưởng tàu cuốc, tàu hút phun, tàu NV bằng gầu ngoạm"]
[null,"NVBMT11",null,4.92,{"$f":"IF(CF_TDNCXD=0,D323*LNC_dauvao,D323*LTTV)","v":0},{"$f":"$F$9*CF_TDNCXD","v":0},0,0,0,0,0,0,{"$f":"ROUND(SUM(E323:L323)/26,0)","v":0},null,null,null,4.92,4.92]
[null,"NVBMT12",null,5.19,{"$f":"IF(CF_TDNCXD=0,D324*LNC_dauvao,D324*LTTV)","v":0},{"$f":"$F$9*CF_TDNCXD","v":0},0,0,0,0,0,0,{"$f":"ROUND(SUM(E324:L324)/26,0)","v":0},null,null,null,5.19,5.19]
[null,"NVBMT13",null,5.19,{"$f":"IF(CF_TDNCXD=0,D325*LNC_dauvao,D325*LTTV)","v":0},{"$f":"$F$9*CF_TDNCXD","v":0},0,0,0,0,0,0,{"$f":"ROUND(SUM(E325:L325)/26,0)","v":0},null,null,null,5.19,5.19]
[null,"NVBMT14",null,5.41,{"$f":"IF(CF_TDNCXD=0,D326*LNC_dauvao,D326*LTTV)","v":0},{"$f":"$F$9*CF_TDNCXD","v":0},0,0,0,0,0,0,{"$f":"ROUND(SUM(E326:L326)/26,0)","v":0},null,null,null,5.41,5.41]
["3. Điện trưởng, đại phó tàu cuốc; kỹ thuật viên cuốc 1, tàu hút bụng; thuyền phó 2, máy 3 tàu hút bụng; máy 3, kỹ thuật viên"]
["cuốc 2 tàu cuốc, tàu hút phun, tàu nạo vét bằng gầu ngoạm"]
[null,"NVBDT11",null,4.37,{"$f":"IF(CF_TDNCXD=0,D329*LNC_dauvao,D329*LTTV)","v":0},{"$f":"$F$9*CF_TDNCXD","v":0},0,0,0,0,0,0,{"$f":"ROUND(SUM(E329:L329)/26,0)","v":0},null,null,null,4.37,4.37]
[null,"NVBDT12",null,4.68,{"$f":"IF(CF_TDNCXD=0,D330*LNC_dauvao,D330*LTTV)","v":0},0,0,0,0,0,0,0,{"$f":"ROUND(SUM(E330:L330)/26,0)","v":0},null,null,null,4.68,4.68]
[null,"NVBDT13",null,4.68,{"$f":"IF(CF_TDNCXD=0,D331*LNC_dauvao,D331*LTTV)","v":0},0,0,0,0,0,0,0,{"$f":"ROUND(SUM(E331:L331)/26,0)","v":0},null,null,null,4.68,4.68]
[null,"NVBDT14",null,4.92,{"$f":"IF(CF_TDNCXD=0,D332*LNC_dauvao,D332*LTTV)","v":0},0,0,0,0,0,0,0,{"$f":"ROUND(SUM(E332:L332)/26,0)","v":0},null,null,null,4.92,4.92]
["4. Đại phó, máy 2 tàu hút bụng; máy 2, kỹ thuật viên cuốc 1 tàu cuốc, tàu hút phun, tàu NV bằng gầu ngoạm"]
[null,"NVBDP11",null,4.68,{"$f":"IF(CF_TDNCXD=0,D334*LNC_dauvao,D334*LTTV)","v":0},0,0,0,0,0,0,0,{"$f":"ROUND(SUM(E334:L334)/26,0)","v":0},null,null,null,4.68,4.68]
[null,"NVBDP12",null,4.92,0,0,0,0,0,0,0,0,{"$f":"ROUND(SUM(E335:L335)/26,0)","v":0},null,null,null,4.92,4.92]
[null,"NVBDP13",null,4.92,0,0,0,0,0,0,0,0,{"$f":"ROUND(SUM(E336:L336)/26,0)","v":0},null,null,null,4.92,4.92]
[null,"NVBDP14",null,5.19,0,0,0,0,0,0,0,0,{"$f":"ROUND(SUM(E337:L337)/26,0)","v":0},null,null,null,5.19,5.19]
["5. Thuyền phó 2 tàu cuốc, kỹ thuật viên cuốc 2 tàu hút; thuyền phó 3, máy 4 tàu hút bụng; máy 3, kỹ thuật viên cuốc 3 tàu cuốc, tàu hút phun,",null,null,0,0,null,0,0,0,0,0,0]
["tàu NV bằng gầu ngoạm",null,null,0,0,null,0,0,0,0,0,0]
[null,"NVBTP211",null,4.16,0,{"$f":"$F$9*CF_TDNCXD","v":0},0,0,0,0,0,0,{"$f":"ROUND(SUM(E340:L340)/26,0)","v":0},null,null,null,4.16,4.16]
[null,"NVBTP212",null,4.37,0,0,0,0,0,0,0,0,{"$f":"ROUND(SUM(E341:L341)/26,0)","v":0},null,null,null,4.37,4.37]
[null,"NVBTP213",null,4.37,0,0,0,0,0,0,0,0,{"$f":"ROUND(SUM(E342:L342)/26,0)","v":0},null,null,null,4.37,4.37]
[null,"NVBTP214",null,4.68,0,0,0,0,0,0,0,0,{"$f":"ROUND(SUM(E343:L343)/26,0)","v":0},null,null,null,4.68,4.68]
["6. Thuyền phó 3 tàu cuốc, tàu hút phun, tàu NV bằng gầu ngoạm, kỹ thuật viên cuốc 3 tàu hút bụng",null,null,{"$f":"IF(CF_TDNCXD=0,R344,Q344)","v":0},0,0,{"$f":"PC_LP*$E344*CF_TDNCXD","v":0},{"$f":"PC_K*$E344*CF_TDNCXD","v":0},{"$f":"PC_KODSX*$E344*CF_TDNCXD","v":0},{"$f":"PC_TH*$E344*CF_TDNCXD","v":0},{"$f":"PC_DB*$E344*CF_TDNCXD","v":0},{"$f":"PC_CD*$E344*CF_TDNCXD","v":0}]
[null,"NVBTP311",null,3.91,0,0,0,0,0,0,0,0,{"$f":"ROUND(SUM(E345:L345)/26,0)","v":0},null,null,null,3.91,3.91]
[null,"NVBTP312",null,4.16,0,0,0,0,0,0,0,0,{"$f":"ROUND(SUM(E346:L346)/26,0)","v":0},null,null,null,4.16,4.16]
[null,"NVBTP313",null,4.16,0,0,0,0,0,0,0,0,{"$f":"ROUND(SUM(E347:L347)/26,0)","v":0},null,null,null,4.16,4.16]
[null,"NVBTP314",null,4.37,0,0,0,0,0,0,0,0,{"$f":"ROUND(SUM(E348:L348)/26,0)","v":0},null,null,null,4.37,4.37]
["7. Quản trị trưởng, thuỷ thủ trưởng",null,null,0,0,0,0,0,0,0,0,0]
[null,"NVBQT11",null,3.5,0,0,0,0,0,0,0,0,{"$f":"ROUND(SUM(E350:L350)/26,0)","v":0},null,null,null,3.5,3.5]
[null,"NVBQT12",null,3.73,0,0,0,0,0,0,0,0,{"$f":"ROUND(SUM(E351:L351)/26,0)","v":0},null,null,null,3.73,3.73]
[null,"NVBQT13",null,3.73,0,0,0,0,0,0,0,0,{"$f":"ROUND(SUM(E352:L352)/26,0)","v":0},null,null,null,3.73,3.73]
[null,"NVBQT114",null,3.91,0,0,0,0,0,0,0,0,{"$f":"ROUND(SUM(E353:L353)/26,0)","v":0},null,null,null,3.91,3.91]
["CHỨC DANH KHÔNG THEO NHÓM TÀU",null,null,0,0,null,0,0,0,0,0,0]
["1. Thợ máy kiêm cơ khí",null,null,0,0,null,0,0,0,0,0,0]
[null,"NVBTM1",null,2.5099999999999998,0,{"$f":"$F$9*CF_TDNCXD","v":0},0,0,0,0,0,0,{"$f":"ROUND(SUM(E356:L356)/26,0)","v":0},null,null,null,2.5099999999999998,2.5099999999999998]
[null,"NVBTM2",null,2.83,0,0,0,0,0,0,0,0,{"$f":"ROUND(SUM(E357:L357)/26,0)","v":0},null,null,null,2.83,2.83]
[null,"NVBTM3",null,3.28,0,0,0,0,0,0,0,0,{"$f":"ROUND(SUM(E358:L358)/26,0)","v":0},null,null,null,3.28,3.28]
[null,"NVBTM4",null,3.91,0,0,0,0,0,0,0,0,{"$f":"ROUND(SUM(E359:L359)/26,0)","v":0},null,null,null,3.91,3.91]
["2. Thợ máy, điện, điện báo",null,null,0,0,0,0,0,0,0,0,0]
[null,"NVBDB1",null,2.35,0,0,0,0,0,0,0,0,{"$f":"ROUND(SUM(E361:L361)/26,0)","v":0},null,null,null,2.35,2.35]
[null,"NVBDB2",null,2.66,0,0,0,0,0,0,0,0,{"$f":"ROUND(SUM(E362:L362)/26,0)","v":0},null,null,null,2.66,2.66]
[null,"NVBDB3",null,3.12,0,0,0,0,0,0,0,0,{"$f":"ROUND(SUM(E363:L363)/26,0)","v":0},null,null,null,3.12,3.12]
[null,"NVBDB4",null,3.73,0,0,0,0,0,0,0,0,{"$f":"ROUND(SUM(E364:L364)/26,0)","v":0},null,null,null,3.73,3.73]
["3. Thuỷ thủ, thợ cuốc",null,null,0,0,null,0,0,0,0,0,0]
[null,"NVBTC1","1/4",2.1800000000000002,0,{"$f":"$F$9*CF_TDNCXD","v":0},0,0,0,0,0,0,{"$f":"ROUND(SUM(E366:L366)/26,0)","v":0},null,null,null,2.1800000000000002,2.1800000000000002]
[null,"NVBTC2","2/4",2.59,0,{"$f":"$F$9*CF_TDNCXD","v":0},0,0,0,0,0,0,{"$f":"ROUND(SUM(E367:L367)/26,0)","v":0},null,null,null,2.59,2.59]
[null,"NVBTC3","3/4",3.08,0,{"$f":"$F$9*CF_TDNCXD","v":0},0,0,0,0,0,0,{"$f":"ROUND(SUM(E368:L368)/26,0)","v":0},null,null,null,3.08,3.08]
[null,"NVBTC4","4/4",3.73,0,{"$f":"$F$9*CF_TDNCXD","v":0},0,0,0,0,0,0,{"$f":"ROUND(SUM(E369:L369)/26,0)","v":0},null,null,null,3.73,3.73]
["4. Phục vụ viên",null,null,0,0,null,0,0,0,0,0,0]
[null,"NVBPV1",null,1.75,0,{"$f":"$F$9*CF_TDNCXD","v":0},0,0,0,0,0,0,{"$f":"ROUND(SUM(E371:L371)/26,0)","v":0},null,null,null,1.75,1.75]
[null,"NVBPV2",null,1.99,0,{"$f":"$F$9*CF_TDNCXD","v":0},0,0,0,0,0,0,{"$f":"ROUND(SUM(E372:L372)/26,0)","v":0},null,null,null,1.99,1.99]
[null,"NVBPV3","2,7/4",2.242,0,{"$f":"$F$9*CF_TDNCXD","v":0},0,0,0,0,0,0,{"$f":"ROUND(SUM(E373:L373)/26,0)","v":0},null,null,null,2.242,2.242]
[null,"NVBPV4","3/4",2.35,0,{"$f":"$F$9*CF_TDNCXD","v":0},0,0,0,0,0,0,{"$f":"ROUND(SUM(E374:L374)/26,0)","v":0},null,null,null,2.35,2.35]
[null,"NVBPV5",null,2.66,0,{"$f":"$F$9*CF_TDNCXD","v":0},0,0,0,0,0,0,{"$f":"ROUND(SUM(E375:L375)/26,0)","v":0},null,null,null,2.66,2.66]
["5. Cấp dưỡng",null,null,0,0,null,0,0,0,0,0,0]
[null,"NVBCD1",null,1.93,0,{"$f":"$F$9*CF_TDNCXD","v":0},0,0,0,0,0,0,{"$f":"ROUND(SUM(E377:L377)/26,0)","v":0},null,null,null,1.93,1.93]
[null,"NVBCD2",null,2.38,0,{"$f":"$F$9*CF_TDNCXD","v":0},0,0,0,0,0,0,{"$f":"ROUND(SUM(E378:L378)/26,0)","v":0},null,null,null,2.38,2.38]
[null,"NVBCD3",null,2.74,0,{"$f":"$F$9*CF_TDNCXD","v":0},0,0,0,0,0,0,{"$f":"ROUND(SUM(E379:L379)/26,0)","v":0},null,null,null,2.74,2.74]
[null,"NVBCD4",null,3.15,0,{"$f":"$F$9*CF_TDNCXD","v":0},0,0,0,0,0,0,{"$f":"ROUND(SUM(E380:L380)/26,0)","v":0},null,null,null,3.15,3.15]
[]
["BẢNG BẢNG LƯƠNG KỸ SƯ, CHUYÊN VIÊN, KINH TẾ VIÊN"]
[null,"N28108",1,{"$f":"IF(CF_TDNCXD=0,R383,Q383)","v":2.34},{"$f":"IF(CF_TDNCXD=0,D383*LNC_dauvao,D383*LTTV)","v":0},{"$f":"$F$9*CF_TDNCXD","v":0},{"$f":"PC_LP*$E383*CF_TDNCXD","v":0},{"$f":"PC_K*$E383*CF_TDNCXD","v":0},{"$f":"PC_KODSX*$E383*CF_TDNCXD","v":0},{"$f":"PC_TH*$E383*CF_TDNCXD","v":0},{"$f":"PC_DB*$E383*CF_TDNCXD","v":0},{"$f":"PC_CD*$E383*CF_TDNCXD","v":0},{"$f":"ROUND(SUM(E383:L383)/26,0)","v":0},null,null,null,2.34,2.34]
[null,"N28208",2,2.65,0,0,0,0,0,0,0,0,0,null,null,null,2.65,2.65]
[null,"N28308",3,2.96,0,0,0,0,0,0,0,0,0,null,null,null,2.96,2.96]
[null,"N28408",4,3.27,0,0,0,0,0,0,0,0,0,null,null,null,3.27,3.27]
[null,"N28458",4.5,3.4249999999999998,0,0,0,0,0,0,0,0,0,null,null,null,3.4249999999999998,3.4249999999999998]
[null,"N28508",5,3.58,0,0,0,0,0,0,0,0,0,null,null,null,3.58,3.58]
[null,"N28608",6,3.89,0,0,0,0,0,0,0,0,0,null,null,null,3.89,3.89]
[null,"N28708",7,4.2,0,0,0,0,0,0,0,0,0,null,null,null,4.2,4.2]
[null,"N28808",8,4.51,0,0,0,0,0,0,0,0,0,null,null,null,4.51,4.51]